Peptide,PTM,ModifiedAA,ModifiedPosition,PeptideUniqueToGene,ExperimentDesc,ExpID,PubmedID,ScoreType,IdentScore,LocProb,Log2FChange,PQ-val,QuantSig,PEP,MassErrorPPM
ASSGGSDRIQVQNPIVE,nt,A,68,true,"N-terminal ChaFRADIC",92,26010716,"MASCOT Score",34.3600000,,,,,5.1659999371623E-6,
ASSGGSDRIQVQNPIVE,nt,A,68,true,"Arg/N-end rule seed, prt6 vs. Wt",99,29168982,"MASCOT Score",47.3600000,,0.0676854,0.4835452,NO,8.5869999999488E-10,-2.2378983
ASSGGSDRIQVQNPIVE,nt,A,68,true,"HUNTER N-terminome: legumain, GluC and trypsin",119,31951383,"MaxQuant score",93.2060000,,,,,,
ASSGGSDRIQVQNPIVE,nt,A,68,true,"Arabidopsis translation initiation landscape - NT",167b,35069635,,,,,,,,
ASSGGSDRIQVQNPIVE,nta,A,68,true,"N-terminal ChaFRADIC",92,26010716,"MASCOT Score",32.7600000,,,,,0.0045520002022386,
ASSGGSDRIQVQNPIVE,nta,A,68,true,"HUNTER N-terminome: legumain, GluC and trypsin",119,31951383,"MaxQuant score",112.8600000,,,,,,
ASSGGSDRIQVQNPIVE,nta,A,68,true,"Arabidopsis translation initiation landscape - NTA",167a,35069635,,,,,,,,
SSGGSDRIQVQNPIVE,nt,S,69,true,"N-terminal ChaFRADIC",92,26010716,"MASCOT Score",27.0900000,,,,,4.7369998355862E-5,
SSGGSDRIQVQNPIVE,nt,S,69,true,"HUNTER N-terminome: legumain, GluC and trypsin",119,31951383,"MaxQuant score",74.3260000,,,,,,
CATITPDEGR,cn,C,145,false,"Cellular regulation by S-cyanylation",115,30377236,,,,,,,,
CATITPDEGR,ox,C,145,false,"OxiTRAQ Arabidopsis - 5 mM H2O2 versus control",47,24376095,,,,0.0940946,0.2191238,NO,,
CATITPDEGR,ox,C,145,false,"Redox kickstart of mitochondria",112,31871212,,,,-0.6454467,0.0082191,YES,,
CATITPDEGR,sno,C,145,false,"Endogenous S-nitrosylation in Arabidopsis",64,22115780,"MASCOT Score",63.0000000,,,,,,
CATITPDEGR,sno,C,145,false,"Cold stress nitrosylation - 4°C vs 22°C",65,24388526,,,,,,,,
CATITPDEGR,sno,C,145,false,"hot5-4 / wildtype, FAT-switch S-nitrosoproteome",169,37277371,,,,,,,,
YNVAIKCATITPDEGR,so,C,145,false,"Arabidopsis S-sulfenylation chemoproteomics",108,31578252,"pFind PSM Score",0.0022367,,,,,,-0.2097731
EPIMCSNIPR,so,C,186,true,"Arabidopsis S-sulfenylation chemoproteomics",108,31578252,"pFind PSM Score",0.1289920,,,,,,1.1852752
LVPGWEKPICIGR,ox,C,201,true,"Redox kickstart of mitochondria",112,31871212,,,,-1.1981314,0.0029022,YES,,
LVPGWEKPICIGR,so,C,201,true,"Arabidopsis S-sulfenylation chemoproteomics",108,31578252,"pFind PSM Score",0.0690471,,0.8792600,,,,-1.6929515
LVPGWEKPICIGR,so,C,201,true,"S-sulfenylation site detection using YAP1C",110,32714340,,,,,,,,
SEGGYVWACK,acy,C,340,false,"Arabidopsis S-acylation atlas - Meristem",163a,35681017,,,,,,,,
SEGGYVWACK,acy,C,340,false,"Arabidopsis S-acylation atlas - Leaf",163c,35681017,,,,,,,,
SEGGYVWACK,sno,C,340,false,"Endogenous S-nitrosylation in Arabidopsis",64,22115780,"MASCOT Score",33.0000000,,,,,,
SEGGYVWACK,sno,C,340,false,"hot5-4 / wildtype, FAT-switch S-nitrosoproteome",169,37277371,,,,0.2434103,0.2359012,NO,,
SEGGYVWACK,so,C,340,false,"Arabidopsis S-sulfenylation chemoproteomics",108,31578252,"pFind PSM Score",0.0000575,,1.4089300,,,,-0.8256362
SEGGYVWACK,so,C,340,false,"S-sulfenylation site detection using YAP1C",110,32714340,,,,,,,,
SADGKTLESEAAHGTVTRHF,nt,S,368,true,"Arabidopsis translation initiation landscape - NT",167b,35069635,,,,,,,,
FIDAVASKLKTQFKE,nt,F,467,true,"Arabidopsis translation initiation landscape - NT",167b,35069635,,,,,,,,
