Peptide,PTM,ModifiedAA,ModifiedPosition,PeptideUniqueToGene,ExperimentDesc,ExpID,PubmedID,ScoreType,IdentScore,LocProb,Log2FChange,PQ-val,QuantSig,PEP,MassErrorPPM
SVPICDSR,ox,C,83,true,"OxiTRAQ Arabidopsis - 5 mM H2O2 versus control",47,24376095,,,,-0.1311191,0.2701689,NO,,
SVPICDSR,sno,C,83,true,"hot5-4 / wildtype, FAT-switch S-nitrosoproteome",169,37277371,,,,,,,,
HSELIPCLDR,sno,C,93,false,"hot5-4 / wildtype, FAT-switch S-nitrosoproteome",169,37277371,,,,,,,,
NLHYQLKLK,ac,K,103,true,"Quantitative Acetylproteomics",101,29440448,,,,,,,,
SFELAHCSR,ox,C,281,false,"OxiTRAQ Arabidopsis - 5 mM H2O2 versus control",47,24376095,,,,-0.1426236,0.1505481,NO,,
SFELAHCSR,sno,C,281,false,"hot5-4 / wildtype, FAT-switch S-nitrosoproteome",169,37277371,,,,-0.0382368,0.6676658,NO,,
RDPGVLPPLCPSGDDPDATWNVSMK,ng,N,383,true,"Conserved N-glycosylation",74,22633491,"MaxQuant Score",177.3700000,1.0000000,,,,0,-0.6620000
ACISPYSVR,acy,C,389,true,"Arabidopsis S-acylation atlas - Meristem",163a,35681017,,,,,,,,
