Peptide,PTM,ModifiedAA,ModifiedPosition,PeptideUniqueToGene,ExperimentDesc,ExpID,PubmedID,ScoreType,IdentScore,LocProb,Log2FChange,PQ-val,QuantSig,PEP,MassErrorPPM
ARVGGVEIPANKRIEY,nt,A,48,true,"Arabidopsis translation initiation landscape - NT",167b,35069635,,,,,,,,
ARVGGVEIPANKRIE,nt,A,48,true,"N-terminal ChaFRADIC",92,26010716,"MASCOT Score",31.2100000,,,,,1.4909999663359E-5,
ARVGGVEIPANKRIE,nt,A,48,true,"HUNTER N-terminome: legumain, GluC and trypsin",119,31951383,"MaxQuant score",106.6000000,,,,,,
ARVGGVEIPANKR,nt,A,48,true,"Stromal N-terminome",96,26371235,"MASCOT Score",36.1300000,,,,,,
ARVGGVEIPAN,nt,A,48,true,"HUNTER N-terminome: legumain, GluC and trypsin",119,31951383,"MaxQuant score",82.7490000,,,,,,
VGGVEIPANKR,ac,K,59,true,"Quantitative Acetylproteomics",101,29440448,,,,,,,,
RFNALAIKR,ac,K,123,true,"Quantitative Acetylproteomics",101,29440448,,,,,,,,
FNALAIKR,ac,K,123,true,"Quantitative Acetylproteomics",101,29440448,,,,,,,,
LKEIQCYR,ac,K,126,true,"Histone deacetylases - apicidin vs control",98a,29061669,"MaxQuant Score",92.8000000,1.0000000,-0.0430000,0.8090959,NO,0.017000000923872,
LKEIQCYR,ac,K,126,true,"Histone deacetylases substrates - TSA vs control",98b,29061669,"MaxQuant Score",92.8000000,1.0000000,-0.1970000,0.9977001,NO,0.017000000923872,
LKEIQCYR,ac,K,126,true,"Histone deacetylases- hda14 vs WT (low light)",98c,29061669,"MaxQuant Score",99.0100000,1.0000000,-0.5350000,0.9885531,NO,0.046999998390675,
EIQCYR,sno,C,130,true,"hot5-4 / wildtype, FAT-switch S-nitrosoproteome",169,37277371,,,,0.2087674,0.1251600,NO,,
HIQGLPCR,sno,C,142,true,"hot5-4 / wildtype, FAT-switch S-nitrosoproteome",169,37277371,,,,-0.3437561,0.2509468,NO,,
IAIAGKK,ac,K,164,true,"Quantitative Acetylproteomics",101,29440448,,,,,,,,
