Peptide,PTM,ModifiedAA,ModifiedPosition,PeptideUniqueToGene,ExperimentDesc,ExpID,PubmedID,ScoreType,IdentScore,LocProb,Log2FChange,PQ-val,QuantSig,PEP,MassErrorPPM
MIGAVNSVEAVITSIQGLSGSPE,nta,M,1,true,"Arabidopsis translation initiation landscape - NTA",167a,35069635,,,,,,,,
FINSCDAGQIR,so,C,93,true,"S-sulfenylation site detection using YAP1C",110,32714340,,,,,,,,
FVSLCK,so,C,109,true,"S-sulfenylation site detection using YAP1C",110,32714340,,,,,,,,
LTALHPDVLQLCLQAK,so,C,154,true,"Arabidopsis S-sulfenylation chemoproteomics",108,31578252,"pFind PSM Score",0.2251540,,1.0989000,,,,-0.9459854
CASTAAQR,sno,C,244,true,"hot5-4 / wildtype, FAT-switch S-nitrosoproteome",169,37277371,,,,,,,,
NLLAMDESLSCDPLYLGK,ox,C,399,true,"SPEAR - 10 mM H2O2 / mock",138a,34619326,,,,2.6590166,0.0004518,YES,,
NLLAMDESLSCDPLYLGK,sno,C,399,true,"Site-specific nitrosomeproteomic id - gsnor1-3",90a,25699590,XCorr,2.7800000,,,,,0.041390001773834,-5.7500000
NLLAMDESLSCDPLYLGK,sno,C,399,true,"Site-specific nitrosomeproteomic id - gsnor1-3",90b,25699590,XCorr,3.8000000,,,,,0.013570000417531,-3.2500000
NLLAMDESLSCDPLYLGK,so,C,399,true,"S-sulfenylation site detection using YAP1C",110,32714340,,,,,,,,
QRYDFGDDFDTVPQKFSM,ph,S,428,true,"TOR Kinase and ABA Receptor",100,29290610,XCorr,2.7532489,1.0000000,,,,0.00088659999892116,
YDFGDDFDTVPQKFSM,ph,S,428,true,"Tissue atlas Arabidopsis - ProteomicsDB",114,32188942,"MaxQuant score",240.8200000,1.0000000,,,,0,
