Peptide,PTM,ModifiedAA,ModifiedPosition,PeptideUniqueToGene,ExperimentDesc,ExpID,PubmedID,ScoreType,IdentScore,LocProb,Log2FChange,PQ-val,QuantSig,PEP,MassErrorPPM
SGNNNNPQKPQG,nt,S,2,true,"Arg/N-end rule seed, prt6 vs. Wt",99,29168982,"MASCOT Score",39.8200000,,,,,8.4650000644615E-6,-5.8637514
SGNNNNPQKPQG,nta,S,2,true,"Arg/N-end rule seed, prt6 vs. Wt",99,29168982,"MASCOT Score",39.8200000,,0.3336180,0.0850125,NO,8.4650000644615E-6,-5.8637514
FQQKPPMRPPGAPASNNTISPMR,ph,S,129,true,"Tissue atlas Arabidopsis - ProteomicsDB",114,32188942,"MaxQuant score",55.3020000,0.9724990,,,,0.00016949299606495,
TMELTPAAR,ph,T,137,true,"Tissue atlas Arabidopsis - ProteomicsDB",114,32188942,"MaxQuant score",136.4800000,1.0000000,,,,0.00023896900529508,
QKLPEKSLQER,ac,K,150,true,"Histone deacetylases substrates - TSA vs control",98b,29061669,"MaxQuant Score",89.3000000,1.0000000,0.7830000,0.7998343,NO,9.0999998292318E-7,
QKLPEKSLQER,ac,K,150,true,"Histone deacetylases- hda14 vs WT (low light)",98c,29061669,"MaxQuant Score",173.1900000,1.0000000,-0.0170000,0.9931160,NO,4.1999999211839E-7,
QKLPEKSLQER,ac,K,150,true,"Quantitative Acetylproteomics",101,29440448,,,,,,,,
SPAPQEGFEIK,ph,S,287,true,"Tissue atlas Arabidopsis - ProteomicsDB",114,32188942,"MaxQuant score",60.3980000,1.0000000,,,,0.008771950379014,
RPAAGNDGPGSW,ph,S,533,true,"atm and atr DNA damage response",88,25561503,"MASCOT Score",53.0000000,1.0000000,,,,,0.5700000
RPAAGNDGPGSW,ph,S,533,true,"TOR Kinase and ABA Receptor",100,29290610,XCorr,3.8323958,1.0000000,,,,0.0015180000336841,
RPAAGNDGPGSW,ph,S,533,true,"Col-0 callus - FC Col-0 vs. Col-0 Xray",111a,31410901,,57.0200000,,0.2877236,0.0000000,NO,,0.2595870
RPAAGNDGPGSW,ph,S,533,true,"Col-0 X-ray callus - FC Col-0 vs. Col-0 Xray",111b,31410901,,57.0200000,,0.2877236,0.0000000,NO,,0.2595870
RPAAGNDGPGSW,ph,S,533,true,"atm callus - FC atm vs. atm Xray",111c,31410901,,57.0200000,,-0.5987175,0.0000000,NO,,0.2595870
RPAAGNDGPGSW,ph,S,533,true,"atm-3 X-ray callus - FC atm vs. atm Xray",111d,31410901,,57.0200000,,-0.5987175,0.0000000,NO,,0.2595870
RPAAGNDGPGSW,ph,S,533,true,"Tissue atlas Arabidopsis - ProteomicsDB",114,32188942,"MaxQuant score",150.5600000,1.0000000,,,,3.9392500639224E-7,
