Peptide,PTM,ModifiedAA,ModifiedPosition,PeptideUniqueToGene,ExperimentDesc,ExpID,PubmedID,ScoreType,IdentScore,LocProb,Log2FChange,PQ-val,QuantSig,PEP,MassErrorPPM
SLSQNAPKSKGIKREELKKQYE,nta,S,2,true,"Arabidopsis translation initiation landscape - NTA",167a,35069635,,,,,,,,
QYEDVEDEEEIGSDDDLTRGK,ph,S,33,true,"Brassinosteroid-Regulated Phosphorylation Dynamics",94,26187819,"MaxQuant Score",180.2100000,1.0000000,,,,0,-2.7010000
QYEDVEDEEEIGSDDDLTRGK,ph,S,33,true,"TOR Kinase and ABA Receptor",100,29290610,XCorr,4.2888618,0.9987000,,,,0.00012929999502376,
KQYEDVEDEEEIGSDDDLTR,ph,S,33,true,"STN8 phosphoproteome",38,21768351,"MASCOT Score",94.3100000,,,,,,-0.4328790
KQYEDVEDEEEIGSDDDLTR,ph,S,33,true,"Large-scale phosphorylation discovery",44,23111157,XCorr,6.0600000,,,,,,
KQYEDVEDEEEIGSDDDLTR,ph,S,33,true,"Chloroplast kinase substrates",60,19376835,"MASCOT Score",84.0700000,,,,,,-1.0773900
KQYEDVEDEEEIGSDDDLTR,ph,S,33,true,"LAXIC - ABA stress",84a,23660473,XCorr,4.0500000,0.9990000,,,,0.010804399847984,
KQYEDVEDEEEIGSDDDLTR,ph,S,33,true,"LAXIC - mannitol vs control",84b,23660473,XCorr,4.7700000,1.0000000,,,,4.3499999046065E-16,
KQYEDVEDEEEIGSDDDLTR,ph,S,33,true,"SnRK2 protein kinase substrates",85,23776212,XCorr,5.0070400,1.0000000,,,,1.485599973117E-13,
KQYEDVEDEEEIGSDDDLTR,ph,S,33,true,"Phospho cell culture sucrose/TOR",109,30833711,,,1.0000000,,,,,
KQYEDVEDEEEIGSDDDLTR,ph,S,33,true,"Col-0 callus - FC Col-0 vs. Col-0 Xray",111a,31410901,,114.2600000,,0.1482771,0.0000000,NO,,1.8323503
KQYEDVEDEEEIGSDDDLTR,ph,S,33,true,"Col-0 X-ray callus - FC Col-0 vs. Col-0 Xray",111b,31410901,,114.2600000,,0.1482771,0.0000000,NO,,1.8323503
KQYEDVEDEEEIGSDDDLTR,ph,S,33,true,"atm callus - FC atm vs. atm Xray",111c,31410901,,114.2600000,,0.8562810,0.0000000,NO,,1.8323503
KQYEDVEDEEEIGSDDDLTR,ph,S,33,true,"atm-3 X-ray callus - FC atm vs. atm Xray",111d,31410901,,114.2600000,,0.8562810,0.0000000,NO,,1.8323503
KQYEDVEDEEEIGSDDDLTR,ph,S,33,true,"Tissue atlas Arabidopsis - ProteomicsDB",114,32188942,"MaxQuant score",456.4500000,1.0000000,,,,0,
QYEDVEDEEEIGSDDDLTR,ph,S,33,true,"Arabidopsis root NAA phosphoproteome",18a,27643528,"MaxQuant Score",164.2700000,0.9990000,,,,7.3370001466461E-30,-0.1230000
QYEDVEDEEEIGSDDDLTR,ph,S,33,true,"STN8 phosphoproteome",38,21768351,"MASCOT Score",119.4500000,,,,,,-1.5130600
QYEDVEDEEEIGSDDDLTR,ph,S,33,true,"Tyrosine phosphorylation in Arabidopsis",59,18463617,"MASCOT Score",61.0000000,,,,,,-1.4983635
QYEDVEDEEEIGSDDDLTR,ph,S,33,true,"srk2dei ABA signaling phopshoproteomics",83,23572148,"MASCOT Score",99.0000000,,,,,,-0.0022000
QYEDVEDEEEIGSDDDLTR,ph,S,33,true,"LAXIC - ABA stress",84a,23660473,XCorr,5.5200000,1.0000000,,,,0.0041439398191869,
QYEDVEDEEEIGSDDDLTR,ph,S,33,true,"LAXIC - mannitol vs control",84b,23660473,XCorr,6.1000000,1.0000000,,,,3.9999998989515E-5,
QYEDVEDEEEIGSDDDLTR,ph,S,33,true,"SnRK2 protein kinase substrates",85,23776212,XCorr,5.5703878,1.0000000,,,,0.00010696700337576,
QYEDVEDEEEIGSDDDLTR,ph,S,33,true,"atm and atr DNA damage response",88,25561503,"MASCOT Score",29.0000000,1.0000000,,,,,-0.2500000
QYEDVEDEEEIGSDDDLTR,ph,S,33,true,"Lateral root-induction - NAA vs control",106,23328941,"MASCOT Score",91.0000000,,,,,,
QYEDVEDEEEIGSDDDLTR,ph,S,33,true,"Col-0 callus - FC Col-0 vs. Col-0 Xray",111a,31410901,,99.5500000,,0.1099782,0.0000000,NO,,1.0911067
QYEDVEDEEEIGSDDDLTR,ph,S,33,true,"Col-0 X-ray callus - FC Col-0 vs. Col-0 Xray",111b,31410901,,99.5500000,,0.1099782,0.0000000,NO,,1.0911067
QYEDVEDEEEIGSDDDLTR,ph,S,33,true,"atm callus - FC atm vs. atm Xray",111c,31410901,,99.5500000,,0.6388921,0.0000000,NO,,1.0911067
QYEDVEDEEEIGSDDDLTR,ph,S,33,true,"atm-3 X-ray callus - FC atm vs. atm Xray",111d,31410901,,99.5500000,,0.6388921,0.0000000,NO,,1.0911067
LENLIFGSLYSPVTFGK,ph,S,70,true,"TOR Kinase and ABA Receptor",100,29290610,XCorr,4.4903536,0.8740000,,,,1.8680000721361E-5,
KLENLIFGSLYSPVTFGK,ph,S,73,true,"TOR Kinase and ABA Receptor",100,29290610,XCorr,4.2409616,0.8863000,,,,2.0190000213915E-5,
EEEEDGSALFHVDR,ph,S,86,true,"Tissue atlas Arabidopsis - ProteomicsDB",114,32188942,"MaxQuant score",156.8800000,1.0000000,,,,2.1350099466133E-10,
QIPDYEDDGDDDEELSDEENGQVVAIRK,ph,Y,102,true,"Brassinosteroid-Regulated Phosphorylation Dynamics",94,26187819,"MaxQuant Score",56.4530000,0.9120000,,,,0.013000000268221,0.1470000
QIPDYEDDGDDDEELSDEENGQVVAIRK,ph,S,113,true,"Brassinosteroid-Regulated Phosphorylation Dynamics",94,26187819,"MaxQuant Score",72.3020000,0.9820000,,,,0.0001948999997694,-0.2280000
QIPDYEDDGDDDEELSDEENGQVVAIRK,ph,S,113,true,"TOR Kinase and ABA Receptor",100,29290610,XCorr,3.7358379,1.0000000,,,,0.00019160000374541,
QIPDYEDDGDDDEELSDEENGQVVAIR,ph,S,113,true,"LAXIC - ABA stress",84a,23660473,XCorr,5.3700000,1.0000000,,,,6.660000053671E-6,
QIPDYEDDGDDDEELSDEENGQVVAIR,ph,S,113,true,"LAXIC - mannitol vs control",84b,23660473,XCorr,5.5300000,1.0000000,,,,4.0799997928775E-12,
QIPDYEDDGDDDEELSDEENGQVVAIR,ph,S,113,true,"SnRK2 protein kinase substrates",85,23776212,XCorr,5.1179357,1.0000000,,,,1.1244700317548E-6,
QIPDYEDDGDDDEELSDEENGQVVAIR,ph,S,113,true,"TOR Kinase and ABA Receptor",100,29290610,XCorr,4.5722866,0.9927000,,,,3.4260000347786E-7,
QIPDYEDDGDDDEELSDEENGQVVAIR,ph,S,113,true,"Lateral root-induction - NAA vs control",106,23328941,"MASCOT Score",27.0000000,,,,,,
QIPDYEDDGDDDEELSDEENGQVVAIR,ph,S,113,true,"Phospho cell culture sucrose/TOR",109,30833711,,,0.9966630,,,,,
QIPDYEDDGDDDEELSDEENGQVVAIR,ph,S,113,true,"Tissue atlas Arabidopsis - ProteomicsDB",114,32188942,"MaxQuant score",150.4500000,1.0000000,,,,0,
QINVDIASVNR,ph,S,144,true,"Tissue atlas Arabidopsis - ProteomicsDB",114,32188942,"MaxQuant score",143.2500000,1.0000000,,,,4.8068198310602E-8,
LNPGTDWARPDSQIVDGESSDDDDTQDGGVDDILRTNEDLVVK,ph,S,194,true,"Brassinosteroid-Regulated Phosphorylation Dynamics",94,26187819,"MaxQuant Score",82.7890000,0.9950000,,,,2.1949999506887E-7,0.8330000
LNPGTDWARPDSQIVDGESSDDDDTQDGGVDDILR,ph,S,194,true,"TOR Kinase and ABA Receptor",100,29290610,XCorr,7.0673079,0.9917000,,,,1.2809999816454E-7,
LNPGTDWARPDSQIVDGESSDDDDTQDGGVDDILR,ph,S,194,true,"Col-0 callus - FC Col-0 vs. Col-0 Xray",111a,31410901,,43.4200000,,1.2629822,0.0000000,NO,,1.4937809
LNPGTDWARPDSQIVDGESSDDDDTQDGGVDDILR,ph,S,194,true,"Col-0 X-ray callus - FC Col-0 vs. Col-0 Xray",111b,31410901,,43.4200000,,1.2629822,0.0000000,NO,,1.4937809
LNPGTDWARPDSQIVDGESSDDDDTQDGGVDDILR,ph,S,194,true,"atm callus - FC atm vs. atm Xray",111c,31410901,,43.4200000,,1.6200020,0.0000000,NO,,1.4937809
LNPGTDWARPDSQIVDGESSDDDDTQDGGVDDILR,ph,S,194,true,"atm-3 X-ray callus - FC atm vs. atm Xray",111d,31410901,,43.4200000,,1.6200020,0.0000000,NO,,1.4937809
LNPGTDWARPDSQIVDGESSDDDDTQDGGVDDILRTNEDLVVK,ph,S,195,true,"Brassinosteroid-Regulated Phosphorylation Dynamics",94,26187819,"MaxQuant Score",82.7890000,0.9950000,,,,2.1949999506887E-7,0.8330000
LNPGTDWARPDSQIVDGESSDDDDTQDGGVDDILR,ph,S,195,true,"TOR Kinase and ABA Receptor",100,29290610,XCorr,7.0673079,0.9917000,,,,1.2809999816454E-7,
LNPGTDWARPDSQIVDGESSDDDDTQDGGVDDILR,ph,S,195,true,"Col-0 callus - FC Col-0 vs. Col-0 Xray",111a,31410901,,43.4200000,,1.2629822,0.0000000,NO,,1.4937809
LNPGTDWARPDSQIVDGESSDDDDTQDGGVDDILR,ph,S,195,true,"Col-0 X-ray callus - FC Col-0 vs. Col-0 Xray",111b,31410901,,43.4200000,,1.2629822,0.0000000,NO,,1.4937809
LNPGTDWARPDSQIVDGESSDDDDTQDGGVDDILR,ph,S,195,true,"atm callus - FC atm vs. atm Xray",111c,31410901,,43.4200000,,1.6200020,0.0000000,NO,,1.4937809
LNPGTDWARPDSQIVDGESSDDDDTQDGGVDDILR,ph,S,195,true,"atm-3 X-ray callus - FC atm vs. atm Xray",111d,31410901,,43.4200000,,1.6200020,0.0000000,NO,,1.4937809
