Peptide,PTM,ModifiedAA,ModifiedPosition,PeptideUniqueToGene,ExperimentDesc,ExpID,PubmedID,ScoreType,IdentScore,LocProb,Log2FChange,PQ-val,QuantSig,PEP,MassErrorPPM
GNLECIYPR,so,C,703,true,"S-sulfenylation site detection using YAP1C",110,32714340,,,,,,,,
ALEEHIPESPSR,ph,S,824,true,"Tissue atlas Arabidopsis - ProteomicsDB",114,32188942,"MaxQuant score",99.8340000,0.9354310,,,,0.00013347300409805,
EMELLNSSDDIRK,ph,S,861,true,"Tissue atlas Arabidopsis - ProteomicsDB",114,32188942,"MaxQuant score",271.0100000,0.8563530,,,,0,
LAYELCEEVNALGK,so,C,1052,true,"Arabidopsis S-sulfenylation chemoproteomics",108,31578252,"pFind PSM Score",0.3343170,,2.1739100,,,,-1.9046656
SVVDLDDDTASEASSNLSGMSAYTLGTR,ph,T,1164,true,"TOR Kinase and ABA Receptor",100,29290610,XCorr,5.0728517,0.8709000,,,,5.3790000009712E-8,
RGSAASVSSSNATSR,ph,S,1186,true,"Tissue atlas Arabidopsis - ProteomicsDB",114,32188942,"MaxQuant score",132.0800000,0.9995160,,,,3.5992499647364E-7,
GSAASVSSSNATSR,ph,S,1186,true,"Large-scale phosphorylation discovery",44,23111157,XCorr,2.5390000,,,,,,
GSAASVSSSNATSR,ph,S,1189,true,"atm and atr DNA damage response",88,25561503,"MASCOT Score",46.0000000,0.9910000,,,,,-0.0700000
GSAASVSSSNATSR,ph,S,1189,true,"Tissue atlas Arabidopsis - ProteomicsDB",114,32188942,"MaxQuant score",119.0200000,0.9996250,,,,3.6912899759045E-6,
GSAASVSSSNATSR,ph,S,1191,true,"atm and atr DNA damage response",88,25561503,"MASCOT Score",46.0000000,0.9110000,,,,,-0.0700000
GSAASVSSSNATSR,ph,S,1192,true,"atm and atr DNA damage response",88,25561503,"MASCOT Score",35.0000000,0.9800000,,,,,-0.1400000
