Peptide,PTM,ModifiedAA,ModifiedPosition,PeptideUniqueToGene,ExperimentDesc,ExpID,PubmedID,ScoreType,IdentScore,LocProb,Log2FChange,PQ-val,QuantSig,PEP,MassErrorPPM
AVSGNGLFTQTNPEVR,nt,A,50,true,"N-terminal ChaFRADIC",92,26010716,"MASCOT Score",114.7600000,,,,,8.4829997604174E-7,
AVSGNGLFTQTNPEVR,nt,A,50,true,"Stromal N-terminome",96,26371235,"MASCOT Score",71.0900000,,,,,,
AVSGNGLFTQTNPEVR,nt,A,50,true,"Arg/N-end rule seed, prt6 vs. Wt",99,29168982,"MASCOT Score",91.2000000,,,,,0.00071370002115145,-1.1865997
AVSGNGLFTQTNPEVR,nt,A,50,true,"FtsH12 N-terminome: WT / FtsH12 knockdown miRNA",118,33216923,"MaxQuant score",71.3790000,,,,,0.081813998520374,
AVSGNGLFTQTNPEVR,nt,A,50,true,"HUNTER N-terminome: legumain, GluC and trypsin",119,31951383,"MaxQuant score",172.1000000,,,,,,
AVSGNGLFTQTNPE,nt,A,50,true,"N-terminal ChaFRADIC",92,26010716,"MASCOT Score",92.1800000,,,,,5.3629999996474E-8,
AVSGNGLFTQTNPE,nt,A,50,true,"HUNTER N-terminome: legumain, GluC and trypsin",119,31951383,"MaxQuant score",119.3900000,,,,,,
AVSGNGLFTQTNPEVR,nta,A,50,true,"Characterization plant N-terminal acetylation",6,22223895,"MASCOT Score",73.6800000,,,,,,
AVSGNGLFTQTNPEVR,nta,A,50,true,"N-terminal ChaFRADIC",92,26010716,"MASCOT Score",114.7600000,,,,,8.4829997604174E-7,
AVSGNGLFTQTNPEVR,nta,A,50,true,"Stromal N-terminome",96,26371235,"MASCOT Score",71.0900000,,,,,,
AVSGNGLFTQTNPEVR,nta,A,50,true,"Arg/N-end rule seed, prt6 vs. Wt",99,29168982,"MASCOT Score",91.2000000,,,,,0.00071370002115145,-1.1865997
AVSGNGLFTQTNPEVR,nta,A,50,true,"HUNTER N-terminome: legumain, GluC and trypsin",119,31951383,"MaxQuant score",176.7800000,,,,,,
AVSGNGLFTQTNPEVR,nta,A,50,true,"Arabidopsis translation initiation landscape - NTA",167a,35069635,,,,,,,,
GLFTQTNPEVR,nt,G,55,true,"Arg/N-end rule seed, prt6 vs. Wt",99,29168982,"MASCOT Score",24.8700000,,-0.7310326,0.6404767,NO,0.14550000429153,-0.5311677
GLFTQTNPE,nt,G,55,true,"Arg/N-end rule seed, prt6 vs. Wt",99,29168982,"MASCOT Score",40.0000000,,-0.2888944,0.7461135,NO,0.058809999376535,-1.1474882
NTYNNFCEDLK,so,C,129,true,"Arabidopsis S-sulfenylation chemoproteomics",108,31578252,"pFind PSM Score",0.0798968,,1.9607800,,,,-1.6421996
LGSFSMSQLGQSK,ph,S,183,true,"atm and atr DNA damage response",88,25561503,"MASCOT Score",28.0000000,1.0000000,,,,,-0.3000000
LGSFSMSQLGQSK,ph,S,183,true,"Tissue atlas Arabidopsis - ProteomicsDB",114,32188942,"MaxQuant score",70.5520000,0.9961120,,,,0.0016636400250718,
YLPSDKAQDAR,ac,K,232,true,"Quantitative Acetylproteomics",101,29440448,,,,,,,,
SKSASPHHGF,nt,S,637,true,"Arabidopsis translation initiation landscape - NT",167b,35069635,,,,,,,,
GSDKGILSDVELLK,ph,S,869,true,"Phosphorylation in N starvation",63,22060019,"MASCOT Score",23.0000000,,,,,,0.9966740
GILSDVELLK,ph,S,869,true,"SnRK2 protein kinase substrates",85,23776212,XCorr,2.4398594,1.0000000,,,,0.024108799174428,
TVFGFLGECLK,so,C,945,true,"S-sulfenylation site detection using YAP1C",110,32714340,,,,,,,,
IDVVVNCSGVFR,ox,C,1086,true,"OxiTRAQ SA and flg22 responses - SA vs mock",91a,25720653,"MASCOT Score",54.4400000,,0.7311832,0.0280000,YES,,
IDVVVNCSGVFR,ox,C,1086,true,"OxiTRAQ SA and flg22 responses - flg22 vs mock",91b,25720653,"MASCOT Score",54.4400000,,0.6959938,0.0300000,YES,,
SFAFDSDAPGAGMAEK,mox,M,1190,true,"cat2 Methionine oxidation - 3h stress",62b,25693801,"MASCOT Score",35.0000000,,1.1353563,,NO,,
