Peptide,PTM,ModifiedAA,ModifiedPosition,PeptideUniqueToGene,ExperimentDesc,ExpID,PubmedID,ScoreType,IdentScore,LocProb,Log2FChange,PQ-val,QuantSig,PEP,MassErrorPPM
SVSGGNGTAGKRTTLHDLYE,nt,S,63,true,"Arabidopsis translation initiation landscape - NT",167b,35069635,,,,,,,,
SVSGGNGTAGKRTTLHDLYE,nta,S,63,true,"HUNTER N-terminome: legumain, GluC and trypsin",119,31951383,"MaxQuant score",,,,,,,
SVSGGNGTAGKRTTLHDLYE,nta,S,63,true,"Arabidopsis translation initiation landscape - NTA",167a,35069635,,,,,,,,
SVSGGNGTAGKR,nta,S,63,true,"Arg/N-end rule pathway Roots",80,25728785,"MASCOT Score",72.3400000,,,,,0.00018719999934547,
VSGGNGTAGKRTTLHDLYE,nt,V,64,true,"Arabidopsis translation initiation landscape - NT",167b,35069635,,,,,,,,
VSGGNGTAGKRTTLHDLYE,nta,V,64,true,"Arabidopsis translation initiation landscape - NTA",167a,35069635,,,,,,,,
GVTSNPAIFQKAISTSNAYNDQFR,nt,G,110,true,"Arabidopsis translation initiation landscape - NT",167b,35069635,,,,,,,,
DIQDACK,ox,C,158,true,"OxiTRAQ Arabidopsis - 5 mM H2O2 versus control",47,24376095,,,,-0.2483438,0.0253800,NO,,
DIQDACK,sno,C,158,true,"hot5-4 / wildtype, FAT-switch S-nitrosoproteome",169,37277371,,,,,,,,
SVEVSPR,ph,S,176,false,"Phospho cell culture sucrose/TOR",109,30833711,,,1.0000000,,,,,
SVEVSPR,ph,S,176,false,"Col-0 callus - FC Col-0 vs. Col-0 Xray",111a,31410901,,36.6100000,,0.4730279,0.0000000,NO,,-0.0549832
SVEVSPR,ph,S,176,false,"Col-0 X-ray callus - FC Col-0 vs. Col-0 Xray",111b,31410901,,36.6100000,,0.4730279,0.0000000,NO,,-0.0549832
SVEVSPR,ph,S,176,false,"atm callus - FC atm vs. atm Xray",111c,31410901,,36.6100000,,-0.5477692,0.0000000,NO,,-0.0549832
SVEVSPR,ph,S,176,false,"atm-3 X-ray callus - FC atm vs. atm Xray",111d,31410901,,36.6100000,,-0.5477692,0.0000000,NO,,-0.0549832
SVEVSPR,ph,S,176,false,"Tissue atlas Arabidopsis - ProteomicsDB",114,32188942,"MaxQuant score",138.2200000,1.0000000,,,,0.00018021400319412,
SVEVSPR,ph,S,180,false,"Lateral root-induction - NAA vs control",106,23328941,"MASCOT Score",32.0000000,,,,,,
SVEVSPR,ph,S,180,false,"Col-0 callus - FC Col-0 vs. Col-0 Xray",111a,31410901,,36.6100000,,0.4730279,0.0000000,NO,,-0.0549832
SVEVSPR,ph,S,180,false,"Col-0 X-ray callus - FC Col-0 vs. Col-0 Xray",111b,31410901,,36.6100000,,0.4730279,0.0000000,NO,,-0.0549832
SVEVSPR,ph,S,180,false,"atm callus - FC atm vs. atm Xray",111c,31410901,,36.6100000,,-0.5477692,0.0000000,NO,,-0.0549832
SVEVSPR,ph,S,180,false,"atm-3 X-ray callus - FC atm vs. atm Xray",111d,31410901,,36.6100000,,-0.5477692,0.0000000,NO,,-0.0549832
SVEVSPR,ph,S,180,false,"Tissue atlas Arabidopsis - ProteomicsDB",114,32188942,"MaxQuant score",138.2200000,1.0000000,,,,0.00018959099543281,
LADDTQGTVEAAK,ph,T,187,true,"Phospho cell culture sucrose/TOR",109,30833711,,,0.9998760,,,,,
LADDTQGTVEAAK,ph,T,187,true,"Tissue atlas Arabidopsis - ProteomicsDB",114,32188942,"MaxQuant score",327.2900000,1.0000000,,,,0,
IPATAPCIPSIR,sno,C,216,true,"Site-specific nitrosomeproteomic id - gsnor1-3",90a,25699590,XCorr,2.0604548,,,,,0.00017020000086632,-6.7875694
IPATAPCIPSIR,sno,C,216,true,"hot5-4 / wildtype, FAT-switch S-nitrosoproteome",169,37277371,,,,,,,,
IPATAPCIPSIR,so,C,216,true,"Arabidopsis S-sulfenylation chemoproteomics",108,31578252,"pFind PSM Score",0.0104673,,0.8620700,,,,-0.5631261
MLEQIGTPEALDLR,ph,T,287,true,"Tissue atlas Arabidopsis - ProteomicsDB",114,32188942,"MaxQuant score",158.6500000,1.0000000,,,,1.4757900457241E-10,
TVSTMPDQALE,nt,T,357,true,"Arg/N-end rule seed, prt6 vs. Wt",99,29168982,"MASCOT Score",26.7200000,,-0.5317995,0.1736800,NO,0.0017239999724552,-3.5294736
TIDANVSEAEGIYSALEK,ph,S,384,true,"Phospho cell culture sucrose/TOR",109,30833711,,,0.9942780,,,,,
TIDANVSEAEGIYSALEK,ph,S,384,true,"Col-0 callus - FC Col-0 vs. Col-0 Xray",111a,31410901,,95.5900000,,-2.9034994,0.0103223,YES,,0.0818839
TIDANVSEAEGIYSALEK,ph,S,384,true,"Col-0 X-ray callus - FC Col-0 vs. Col-0 Xray",111b,31410901,,95.5900000,,-2.9034994,0.0103223,YES,,0.0818839
TIDANVSEAEGIYSALEK,ph,S,384,true,"atm callus - FC atm vs. atm Xray",111c,31410901,,95.5900000,,1.5794605,0.2150638,NO,,0.0818839
TIDANVSEAEGIYSALEK,ph,S,384,true,"atm-3 X-ray callus - FC atm vs. atm Xray",111d,31410901,,95.5900000,,1.5794605,0.2150638,NO,,0.0818839
SLLGTLQDKANTLKLASH,nt,S,421,true,"Arabidopsis translation initiation landscape - NT",167b,35069635,,,,,,,,
