Peptide,PTM,ModifiedAA,ModifiedPosition,PeptideUniqueToGene,ExperimentDesc,ExpID,PubmedID,ScoreType,IdentScore,LocProb,Log2FChange,PQ-val,QuantSig,PEP,MassErrorPPM
GCFSCFDSSDDEKLNPVDESNHGQK,acy,C,3,true,"Arabidopsis S-acylation atlas - Meristem",163a,35681017,,,,,,,,
GCFSCFDSSDDEK,acy,C,3,true,"Arabidopsis S-acylation atlas - Meristem",163a,35681017,,,,,,,,
GCFSCFDSSDDEK,acy,C,3,true,"Arabidopsis S-acylation atlas - Stem",163f,35681017,,,,,,,,
GCFSCFDSSDDEK,ph,S,5,true,"Conserved plant phosphoproteome - Arabidopsis",61a,20466843,"MASCOT Score",29.0000000,1.0000000,,,,,
GCFSCFDSSDDEKLNPVDESNHGQK,acy,C,6,true,"Arabidopsis S-acylation atlas - Meristem",163a,35681017,,,,,,,,
GCFSCFDSSDDEK,acy,C,6,true,"Arabidopsis S-acylation atlas - Meristem",163a,35681017,,,,,,,,
GCFSCFDSSDDEK,acy,C,6,true,"Arabidopsis S-acylation atlas - Stem",163f,35681017,,,,,,,,
GCFSCFDSSDDEK,ph,S,10,true,"Tyrosine phosphorylation in Arabidopsis",59,18463617,"MASCOT Score",70.0000000,,,,,,-0.5512983
GCFSCFDSSDDEK,ph,S,10,true,"srk2dei ABA signaling phopshoproteomics",83,23572148,"MASCOT Score",42.0000000,,,,,,-0.0012000
LNPVDESNHGQKK,ph,S,21,true,"Phospho cell culture sucrose/TOR",109,30833711,,,1.0000000,,,,,
LNPVDESNHGQKK,ph,S,21,true,"Tissue atlas Arabidopsis - ProteomicsDB",114,32188942,"MaxQuant score",307.1000000,1.0000000,,,,0,
LNPVDESNHGQK,ph,S,21,true,"STN8 phosphoproteome",38,21768351,"MASCOT Score",51.4000000,,,,,,-0.4894780
LNPVDESNHGQK,ph,S,21,true,"Large-scale phosphorylation discovery",44,23111157,XCorr,2.9360000,,,,,,
LNPVDESNHGQK,ph,S,21,true,"Chloroplast kinase substrates",60,19376835,"MASCOT Score",51.8200000,,,,,,-0.4894780
LNPVDESNHGQK,ph,S,21,true,"atm and atr DNA damage response",88,25561503,"MASCOT Score",67.0000000,1.0000000,,,,,-0.8200000
LNPVDESNHGQK,ph,S,21,true,"TOR Kinase and ABA Receptor",100,29290610,XCorr,3.2669246,1.0000000,,,,0.00061029999051243,
DGLGQIAAHTFAFR,ph,T,73,true,"Tissue atlas Arabidopsis - ProteomicsDB",114,32188942,"MaxQuant score",106.6000000,1.0000000,,,,0.0002551680081524,
GLEFLHDKANPPVIYR,ub,K,204,true,"Ubiquitination Membrane Proteins",120,33585938,,,,,,,,
GLEFLHDKANPPVIYR,ub,K,204,true,"upl3 mutant / wildtype",168,35926874,"MaxQuant score",106.3000000,1.0000000,,,,3.8088799669822E-8,-1.6363000
LGPTGDKSHVSTR,ph,S,244,true,"atm and atr DNA damage response",88,25561503,"MASCOT Score",30.0000000,1.0000000,,,,,0.6900000
LGPTGDKSHVSTR,ph,S,244,true,"Phospho cell culture sucrose/TOR",109,30833711,,,0.9464440,,,,,
LGPTGDKSHVSTR,ph,S,244,true,"Tissue atlas Arabidopsis - ProteomicsDB",114,32188942,"MaxQuant score",59.5850000,0.9671500,,,,0.0045806202106178,
LGPTGDKSHVSTR,ph,S,247,true,"Tissue atlas Arabidopsis - ProteomicsDB",114,32188942,"MaxQuant score",59.5850000,0.8019470,,,,0.0045806202106178,
NDDGGGSGSKFDLEGSEKEDSPR,ph,S,396,true,"Tissue atlas Arabidopsis - ProteomicsDB",114,32188942,"MaxQuant score",216.1900000,0.9981100,,,,0,
NDDGGGSGSKFDLEGSEK,ph,S,396,true,"Tyrosine phosphorylation in Arabidopsis",59,18463617,"MASCOT Score",23.0000000,,,,,,-1.2248837
NDDGGGSGSKFDLEGSEK,ph,S,398,true,"atm and atr DNA damage response",88,25561503,"MASCOT Score",43.0000000,1.0000000,,,,,-2.8000000
NDDGGGSGSKFDLEGSEKEDSPR,ph,S,405,true,"Tissue atlas Arabidopsis - ProteomicsDB",114,32188942,"MaxQuant score",265.8100000,1.0000000,,,,0,
FDLEGSEKEDSPR,ph,S,405,true,"atm and atr DNA damage response",88,25561503,"MASCOT Score",51.0000000,0.9420000,,,,,-0.0800000
FDLEGSEKEDSPR,ph,S,405,true,"Phospho cell culture sucrose/TOR",109,30833711,,,1.0000000,,,,,
NDDGGGSGSKFDLEGSEKEDSPR,ph,S,410,true,"Tissue atlas Arabidopsis - ProteomicsDB",114,32188942,"MaxQuant score",157.5400000,1.0000000,,,,0,
FDLEGSEKEDSPRETAR,ph,S,410,true,"atm and atr DNA damage response",88,25561503,"MASCOT Score",29.0000000,1.0000000,,,,,2.0800000
FDLEGSEKEDSPRETAR,ph,S,410,true,"Phospho cell culture sucrose/TOR",109,30833711,,,0.9894490,,,,,
FDLEGSEKEDSPR,ph,S,410,true,"atm and atr DNA damage response",88,25561503,"MASCOT Score",41.0000000,1.0000000,,,,,-0.6500000
MWGESLREK,ph,S,437,true,"Tissue atlas Arabidopsis - ProteomicsDB",114,32188942,"MaxQuant score",77.5930000,1.0000000,,,,0.0014450999442488,
