Peptide,PTM,ModifiedAA,ModifiedPosition,PeptideUniqueToGene,ExperimentDesc,ExpID,PubmedID,ScoreType,IdentScore,LocProb,Log2FChange,PQ-val,QuantSig,PEP,MassErrorPPM
GVDPFKTTETLEADKETNGGVPVKDKLTF,nt,G,2,true,"Arabidopsis translation initiation landscape - NT",167b,35069635,,,,,,,,
SQSAQESTVTTENAGTSDISITPR,fuc,S,106,true,"SPINDLY O-fucosylation",162,36739885,,,,,,,-0.85000002384186,
TLSCTSSYER,ph,S,132,true,"Tissue atlas Arabidopsis - ProteomicsDB",114,32188942,"MaxQuant score",69.8150000,0.9945360,,,,0.0062395702116191,
TLSCTSSYER,ox,C,133,true,"OxiTRAQ Arabidopsis - 5 mM H2O2 versus control",47,24376095,,,,0.7395424,0.0036280,YES,,
TLSCTSSYERGGSNR,me1,R,139,true,"Arabidopsis protein methylome",123,31809900,"MaxQuant Score",55.6600000,1.0000000,,,,0.00032322300830856,0.2461300
DYHGEKR,ac,K,188,true,"Quantitative Acetylproteomics",101,29440448,,,,,,,,
YNSDWRTPGR,ph,S,194,true,"Tissue atlas Arabidopsis - ProteomicsDB",114,32188942,"MaxQuant score",80.6900000,0.9464450,,,,0.00074089097324759,
YNSDWRTPGR,ph,T,198,true,"Tissue atlas Arabidopsis - ProteomicsDB",114,32188942,"MaxQuant score",71.9330000,0.8507200,,,,0.0022153300233185,
SDWDDGQDEWERSPHGDR,ph,S,214,true,"atm and atr DNA damage response",88,25561503,"MASCOT Score",51.0000000,1.0000000,,,,,-0.1300000
SDWDDGQDEWERSPHGDR,ph,S,214,true,"Phospho cell culture sucrose/TOR",109,30833711,,,1.0000000,,,,,
SDWDDGQDEWERSPHGDR,ph,S,214,true,"Col-0 callus - FC Col-0 vs. Col-0 Xray",111a,31410901,,21.6400000,,1.6614912,0.0000000,NO,,0.6722255
SDWDDGQDEWERSPHGDR,ph,S,214,true,"Col-0 X-ray callus - FC Col-0 vs. Col-0 Xray",111b,31410901,,21.6400000,,1.6614912,0.0000000,NO,,0.6722255
SDWDDGQDEWERSPHGDR,ph,S,214,true,"atm callus - FC atm vs. atm Xray",111c,31410901,,21.6400000,,0.2883311,0.0000000,NO,,0.6722255
SDWDDGQDEWERSPHGDR,ph,S,214,true,"atm-3 X-ray callus - FC atm vs. atm Xray",111d,31410901,,21.6400000,,0.2883311,0.0000000,NO,,0.6722255
SDWDDGQDEWERSPHGDR,ph,S,214,true,"Tissue atlas Arabidopsis - ProteomicsDB",114,32188942,"MaxQuant score",234.6400000,1.0000000,,,,0,
RPQPSPSPMLAAASPDAR,ph,S,230,true,"atm and atr DNA damage response",88,25561503,"MASCOT Score",40.0000000,1.0000000,,,,,0.1600000
RPQPSPSPMLAAASPDAR,ph,S,230,true,"Tissue atlas Arabidopsis - ProteomicsDB",114,32188942,"MaxQuant score",155.4600000,1.0000000,,,,7.5531702491808E-22,
RPQPSPSPMLAAASPDAR,ph,S,232,true,"atm and atr DNA damage response",88,25561503,"MASCOT Score",37.0000000,0.9920000,,,,,0.0300000
RPQPSPSPMLAAASPDAR,ph,S,232,true,"TOR Kinase and ABA Receptor",100,29290610,XCorr,4.1221728,0.9144000,,,,1.5330000451286E-6,
RPQPSPSPMLAAASPDAR,ph,S,232,true,"Tissue atlas Arabidopsis - ProteomicsDB",114,32188942,"MaxQuant score",128.8800000,1.0000000,,,,9.3994195835955E-15,
RPQPSPSPMLAAASPDAR,ph,S,239,true,"SnRK2 protein kinase substrates",85,23776212,XCorr,2.3009541,1.0000000,,,,0.0050967698916793,
RPQPSPSPMLAAASPDAR,ph,S,239,true,"atm and atr DNA damage response",88,25561503,"MASCOT Score",53.0000000,1.0000000,,,,,-0.6900000
RPQPSPSPMLAAASPDAR,ph,S,239,true,"TOR Kinase and ABA Receptor",100,29290610,XCorr,4.2007966,1.0000000,,,,4.5460001274478E-6,
RPQPSPSPMLAAASPDAR,ph,S,239,true,"Phospho cell culture sucrose/TOR",109,30833711,,,1.0000000,,,,,
RPQPSPSPMLAAASPDAR,ph,S,239,true,"Tissue atlas Arabidopsis - ProteomicsDB",114,32188942,"MaxQuant score",172.5700000,1.0000000,,,,7.2129100127315E-28,
LASPWLDTPR,ph,S,246,true,"atm and atr DNA damage response",88,25561503,"MASCOT Score",30.0000000,1.0000000,,,,,-0.0200000
LASPWLDTPR,ph,S,246,true,"Tissue atlas Arabidopsis - ProteomicsDB",114,32188942,"MaxQuant score",153.3400000,1.0000000,,,,9.4996300958883E-7,
LASPWLDTPR,ph,T,251,true,"atm and atr DNA damage response",88,25561503,"MASCOT Score",39.0000000,1.0000000,,,,,0.3500000
LASPWLDTPR,ph,T,251,true,"TOR Kinase and ABA Receptor",100,29290610,XCorr,2.4946825,1.0000000,,,,0.00028479998582043,
LASPWLDTPR,ph,T,251,true,"Lateral root-induction - NAA vs control",106,23328941,"MASCOT Score",31.0000000,,,,,,
LASPWLDTPR,ph,T,251,true,"Tissue atlas Arabidopsis - ProteomicsDB",114,32188942,"MaxQuant score",145.2900000,1.0000000,,,,1.8667500398806E-6,
STMSSASPWDMGAPSPIPIR,ph,S,268,true,"TOR Kinase and ABA Receptor",100,29290610,XCorr,4.8189583,1.0000000,,,,1.3390000503932E-6,
STMSSASPWDMGAPSPIPIR,ph,S,268,true,"Tissue atlas Arabidopsis - ProteomicsDB",114,32188942,"MaxQuant score",257.7200000,1.0000000,,,,0,
EGDLTNEGHSDEDRSQGAEEFK,ph,S,307,true,"srk2dei ABA signaling phopshoproteomics",83,23572148,"MASCOT Score",42.0000000,,,,,,0.0004000
EGDLTNEGHSDEDRSQGAEEFK,ph,S,307,true,"TOR Kinase and ABA Receptor",100,29290610,XCorr,4.0480895,0.9830000,,,,1.30899998112E-5,
EGDLTNEGHSDEDRSQGAEEFK,ph,S,307,true,"Phospho cell culture sucrose/TOR",109,30833711,,,1.0000000,,,,,
EGDLTNEGHSDEDR,ph,S,307,true,"Large-scale phosphorylation discovery",44,23111157,XCorr,3.2140000,,,,,,
EGDLTNEGHSDEDR,ph,S,307,true,"SnRK2 protein kinase substrates",85,23776212,XCorr,2.9381347,1.0000000,,,,0.007159530185163,
EGDLTNEGHSDEDR,ph,S,307,true,"atm and atr DNA damage response",88,25561503,"MASCOT Score",89.0000000,1.0000000,,,,,0.7200000
EGDLTNEGHSDEDR,ph,S,307,true,"TOR Kinase and ABA Receptor",100,29290610,XCorr,4.1153402,0.9989000,,,,0.00045970000792295,
EGDLTNEGHSDEDR,ph,S,307,true,"Col-0 callus - FC Col-0 vs. Col-0 Xray",111a,31410901,,35.1900000,,-4.6969270,0.0000000,NO,,0.6693062
EGDLTNEGHSDEDR,ph,S,307,true,"Col-0 X-ray callus - FC Col-0 vs. Col-0 Xray",111b,31410901,,35.1900000,,-4.6969270,0.0000000,NO,,0.6693062
EGDLTNEGHSDEDR,ph,S,307,true,"atm callus - FC atm vs. atm Xray",111c,31410901,,35.1900000,,3.7786174,0.0000000,NO,,0.6693062
EGDLTNEGHSDEDR,ph,S,307,true,"atm-3 X-ray callus - FC atm vs. atm Xray",111d,31410901,,35.1900000,,3.7786174,0.0000000,NO,,0.6693062
EGDLTNEGHSDEDR,ph,S,307,true,"Tissue atlas Arabidopsis - ProteomicsDB",114,32188942,"MaxQuant score",340.5200000,1.0000000,,,,0,
EGDLTNEGHSDEDRSQGAEEFK,ph,S,312,true,"TOR Kinase and ABA Receptor",100,29290610,XCorr,2.7152119,1.0000000,,,,0.0055510001257062,
GTEVQTEFDSEEERK,ph,S,422,true,"Phospho cell culture sucrose/TOR",109,30833711,,,0.9158840,,,,,
GTEVQTEFDSEEER,ph,S,422,true,"Tissue atlas Arabidopsis - ProteomicsDB",114,32188942,"MaxQuant score",223.7000000,1.0000000,,,,0,
SDMAIISR,nt,S,461,true,"Stromal N-terminome",96,26371235,"MASCOT Score",50.5300000,,,,,,
SDMAIISR,nta,S,461,true,"Stromal N-terminome",96,26371235,"MASCOT Score",50.5300000,,,,,,
VGCTQPR,so,C,608,false,"S-sulfenylation site detection using YAP1C",110,32714340,,,,,,,,
TNLGNVVLLLK,ph,T,920,true,"Lateral root-induction - NAA vs control",106,23328941,"MASCOT Score",28.0000000,,,,,,
AICSAYFHNSAR,so,C,1105,true,"Arabidopsis S-sulfenylation chemoproteomics",108,31578252,"pFind PSM Score",0.0003692,,1.5180300,,,,-1.1173374
DQVESELRSK,ph,S,1221,true,"Tissue atlas Arabidopsis - ProteomicsDB",114,32188942,"MaxQuant score",135.6500000,0.9998490,,,,2.9940900276415E-5,
