Peptide,PTM,ModifiedAA,ModifiedPosition,PeptideUniqueToGene,ExperimentDesc,ExpID,PubmedID,ScoreType,IdentScore,LocProb,Log2FChange,PQ-val,QuantSig,PEP,MassErrorPPM
GFIKTGLGNR,ac,K,185,true,"Histone deacetylases - apicidin vs control",98a,29061669,"MaxQuant Score",169.2000000,1.0000000,-0.3370000,0.1849269,NO,7.6999997556445E-21,
SLCVACGSNVGDGTEHR,acy,C,244,true,"Arabidopsis S-acylation atlas - Stem",163f,35681017,,,,,,,,
SLCVACGSNVGDGTEHR,sno,C,244,true,"hot5-4 / wildtype, FAT-switch S-nitrosoproteome",169,37277371,,,,,,,,
SLCVACGSNVGDGTEHR,so,C,244,true,"Arabidopsis S-sulfenylation chemoproteomics",108,31578252,"pFind PSM Score",0.0066337,,1.1836600,,,,-1.0895031
SSPDAPKLAQEK,ac,K,337,true,"Histone deacetylases substrates - TSA vs control",98b,29061669,"MaxQuant Score",58.3000000,1.0000000,0.2460000,0.9794900,NO,0.0060000000521541,
LAQEKLDK,ac,K,342,true,"Histone deacetylases - apicidin vs control",98a,29061669,"MaxQuant Score",121.5000000,1.0000000,-0.2670000,0.2766942,NO,0.0040000001899898,
LAQEKLDK,ac,K,342,true,"Histone deacetylases substrates - hda14 vs WT",98e,29061669,"MaxQuant Score",72.3000000,1.0000000,0.2420000,0.7709035,NO,0.0089999996125698,
LAQEKLDK,ac,K,342,true,"Quantitative Acetylproteomics",101,29440448,,,,,,,,
