Peptide,PTM,ModifiedAA,ModifiedPosition,PeptideUniqueToGene,ExperimentDesc,ExpID,PubmedID,ScoreType,IdentScore,LocProb,Log2FChange,PQ-val,QuantSig,PEP,MassErrorPPM
GNCCGNPSSATNQSK,myr,G,2,true,"N-Terminal Myristoylated Proteins",102,29453228,,,,,,,,
NNPFYSNEYATTDR,ph,S,29,true,"Tissue atlas Arabidopsis - ProteomicsDB",114,32188942,"MaxQuant score",170.4200000,0.9999950,,,,1.0359499877331E-15,
NNPFYSNEYATTDR,ph,Y,32,true,"TOR Kinase and ABA Receptor",100,29290610,XCorr,3.1554577,0.9395000,,,,0.0013119999784976,
NNPFYSNEYATTDRSGAGFK,ph,T,35,true,"TOR Kinase and ABA Receptor",100,29290610,XCorr,3.2241585,0.7800000,,,,0.00094449997413903,
NNPFYSNEYATTDRSGAGFK,ph,S,38,true,"Tissue atlas Arabidopsis - ProteomicsDB",114,32188942,"MaxQuant score",325.6000000,0.9999770,,,,0,
SVIDFKR,ac,K,279,false,"Quantitative Acetylproteomics",101,29440448,,,,,,,,
KAPNVSLGETVK,ph,T,331,false,"Tissue atlas Arabidopsis - ProteomicsDB",114,32188942,"MaxQuant score",113.5200000,0.9997830,,,,0.00012526000500657,
KAPNVSLGETVKAR,ac,K,333,false,"Quantitative Acetylproteomics",101,29440448,,,,,,,,
DVDTDKDGR,ac,K,485,false,"Quantitative Acetylproteomics",101,29440448,,,,,,,,
FNSLSLK,ph,S,520,false,"Large-scale phosphorylation discovery",44,23111157,XCorr,2.1050000,,,,,,
FNSLSLK,ph,S,520,false,"srk2dei ABA signaling phopshoproteomics",83,23572148,"MASCOT Score",26.0000000,,,,,,-0.0002000
FNSLSLK,ph,S,520,false,"Phospho cell culture sucrose/TOR",109,30833711,,,0.9831330,,,,,
DGSLQLEGET,ph,S,528,true,"atm and atr DNA damage response",88,25561503,"MASCOT Score",49.0000000,1.0000000,,,,,0.1100000
DGSLQLEGET,ph,S,528,true,"Tissue atlas Arabidopsis - ProteomicsDB",114,32188942,"MaxQuant score",211.0200000,1.0000000,,,,4.2001300184147E-19,
