Peptide,PTM,ModifiedAA,ModifiedPosition,PeptideUniqueToGene,ExperimentDesc,ExpID,PubmedID,ScoreType,IdentScore,LocProb,Log2FChange,PQ-val,QuantSig,PEP,MassErrorPPM
ESTTQFCSAGR,nt,E,23,true,"Arg/N-end rule pathway Roots",80,25728785,"MASCOT Score",69.9700000,,,,,0.00015989999519661,
ESTTQFCSAGR,nt,E,23,true,"Arabidopsis translation initiation landscape - NT",167b,35069635,,,,,,,,
ENGVGSCGVSSTRILIK,ph,S,39,true,"srk2dei ABA signaling phopshoproteomics",83,23572148,"MASCOT Score",23.0000000,,,,,,0.0051000
ENGVGSCGVSSTR,ox,C,40,true,"OxiTRAQ Arabidopsis - 5 mM H2O2 versus control",47,24376095,,,,-0.2458903,0.2354546,NO,,
ENGVGSCGVSSTR,sno,C,40,true,"hot5-4 / wildtype, FAT-switch S-nitrosoproteome",169,37277371,,,,0.3799537,0.0128235,NO,,
SVDAMDEIAKAR,nt,S,285,true,"Arabidopsis translation initiation landscape - NT",167b,35069635,,,,,,,,
SPPIRPVGHGKALQ,nt,S,332,true,"Arabidopsis translation initiation landscape - NT",167b,35069635,,,,,,,,
ALQDALSTGILQLVGTDHCTFNSTQK,ng,N,364,true,"Conserved N-glycosylation",74,22633491,"MaxQuant Score",245.4900000,1.0000000,,,,0,2.5060000
ALQDALSTGILQLVGTDHCTFNSTQK,ng,N,364,true,"ER-associatied N-glycan degradation chilling stres",133,27558752,,,,,,,,
ITSTECAR,ox,C,415,true,"OxiTRAQ Arabidopsis - 5 mM H2O2 versus control",47,24376095,,,,-0.0672391,0.5939539,NO,,
ITSTECAR,sno,C,415,true,"hot5-4 / wildtype, FAT-switch S-nitrosoproteome",169,37277371,,,,-0.2816460,0.0135896,NO,,
KGAILAGSDADIIILNPNSSYEISSK,ng,N,442,true,"Conserved N-glycosylation",74,22633491,"MaxQuant Score",134.8500000,0.7960000,,,,1.3769999988055E-24,-1.0770000
KGAILAGSDADIIILNPNSSYEISSK,ng,N,442,true,"ER-associatied N-glycan degradation chilling stres",133,27558752,,,,,,,,
KGAILAGSDADIIILNPNSSYEISSK,ng,N,442,true,"N-linked Glycan Micro-heterogeneity Arabidopsis",134,29237727,,,,,,,,
KGAILAGSDADIIILNPNSSYEISSK,ng,N,442,true,"UDP-GlcNAc transporter glycopeptide analysis",135,30224661,,,,,,,2.3070657797358E-12,0.9000000
SDTNVYEGR,nt,S,456,true,"Arabidopsis translation initiation landscape - NT",167b,35069635,,,,,,,,
