Peptide,PTM,ModifiedAA,ModifiedPosition,PeptideUniqueToGene,ExperimentDesc,ExpID,PubmedID,ScoreType,IdentScore,LocProb,Log2FChange,PQ-val,QuantSig,PEP,MassErrorPPM
MEAESSTPQER,nta,M,1,true,"Arabidopsis translation initiation landscape - NTA",167a,35069635,,,,,,,,
HNMSEIPMPYTKESK,ph,S,336,true,"Phosphorylation in N starvation",63,22060019,"MASCOT Score",25.0000000,,,,,,-0.2680960
VLFPDQESEGHSVSR,ph,S,388,true,"Tissue atlas Arabidopsis - ProteomicsDB",114,32188942,"MaxQuant score",105.9900000,0.9820500,,,,2.2883200472279E-6,
VLFPDQESEGHSVSR,ph,S,392,true,"Tissue atlas Arabidopsis - ProteomicsDB",114,32188942,"MaxQuant score",161.4800000,0.9877510,,,,1.6094199540781E-12,
QISEATKSPTQSSSSR,ph,S,429,true,"Tissue atlas Arabidopsis - ProteomicsDB",114,32188942,"MaxQuant score",163.5300000,0.9773420,,,,9.1265995886473E-15,
GTLRPAPLIISPDK,ph,S,457,true,"Tissue atlas Arabidopsis - ProteomicsDB",114,32188942,"MaxQuant score",90.2200000,1.0000000,,,,6.2264000007417E-5,
NDPLHDYSPLGIR,ph,S,586,true,"Tissue atlas Arabidopsis - ProteomicsDB",114,32188942,"MaxQuant score",134.0800000,0.9999970,,,,1.2221000361023E-5,
LLMSTMTCMSPLR,ph,S,602,true,"Tissue atlas Arabidopsis - ProteomicsDB",114,32188942,"MaxQuant score",170.7400000,0.9999640,,,,4.4332700725248E-15,
LWESPTGK,ph,S,609,true,"Tissue atlas Arabidopsis - ProteomicsDB",114,32188942,"MaxQuant score",90.2630000,0.8918740,,,,0.0068128099665046,
TLVGAQSILR,ph,S,621,true,"Tissue atlas Arabidopsis - ProteomicsDB",114,32188942,"MaxQuant score",127.1700000,1.0000000,,,,1.8638000256033E-5,
DLLTPLSEK,ph,T,632,true,"Tissue atlas Arabidopsis - ProteomicsDB",114,32188942,"MaxQuant score",135.8000000,0.9999900,,,,0.0002768549893517,
DLLTPLSEK,ph,S,635,true,"Tissue atlas Arabidopsis - ProteomicsDB",114,32188942,"MaxQuant score",108.9000000,0.9999870,,,,0.00055360700935125,
DLLTPLSEKRSDK,ph,S,639,true,"Tissue atlas Arabidopsis - ProteomicsDB",114,32188942,"MaxQuant score",65.9490000,0.9981580,,,,0.0028317798860371,
EGHLVDNGTSNENFSIFCGTPFR,ph,T,835,true,"Tissue atlas Arabidopsis - ProteomicsDB",114,32188942,"MaxQuant score",110.1700000,0.9995790,,,,1.6397300544312E-16,
GLESPSAWK,ph,S,843,true,"Tissue atlas Arabidopsis - ProteomicsDB",114,32188942,"MaxQuant score",149.1700000,0.9955200,,,,0.00015587100642733,
VLDFNDCESPIK,ph,S,944,true,"Conserved plant phosphoproteome - Arabidopsis",61a,20466843,"MASCOT Score",29.0000000,1.0000000,,,,,
VLDFNDCESPIK,ph,S,944,true,"Tissue atlas Arabidopsis - ProteomicsDB",114,32188942,"MaxQuant score",202.2500000,1.0000000,,,,1.1903999953489E-30,
