Peptide,PTM,ModifiedAA,ModifiedPosition,PeptideUniqueToGene,ExperimentDesc,ExpID,PubmedID,ScoreType,IdentScore,LocProb,Log2FChange,PQ-val,QuantSig,PEP,MassErrorPPM
VFYFKARPDAG,nt,V,2,true,"Arabidopsis translation initiation landscape - NT",167b,35069635,,,,,,,,
GQSFDDISEGVLEDCAQLVK,ph,S,58,true,"SnRK2 protein kinase substrates",85,23776212,XCorr,4.2914534,1.0000000,,,,0.00017840600048658,
GQSFDDISEGVLEDCAQLVK,ph,S,58,true,"Phospho cell culture sucrose/TOR",109,30833711,,,0.9979980,,,,,
TASMDVGQVGFHNSK,ph,S,102,true,"Phospho cell culture sucrose/TOR",109,30833711,,,0.8426300,,,,,
TASMDVGQVGFHNSK,ph,S,102,true,"Tissue atlas Arabidopsis - ProteomicsDB",114,32188942,"MaxQuant score",82.5290000,0.9760570,,,,0.0002089280023938,
LNKTKVER,ub,K,134,true,"Arabidopsis ubiquitination COFRADIC",40,26744219,"MaxQuant Score",100.0200000,1.0000000,,,,0.0040000001899898,0.1540000
MTSNKDIASSNK,ph,S,196,true,"Tissue atlas Arabidopsis - ProteomicsDB",114,32188942,"MaxQuant score",78.8090000,0.9969880,,,,0.0030909099150449,
DIASSNKSLQELEDDFM,ph,S,206,true,"Tissue atlas Arabidopsis - ProteomicsDB",114,32188942,"MaxQuant score",170.9100000,0.8786720,,,,5.5545299301971E-22,
