Peptide,PTM,ModifiedAA,ModifiedPosition,PeptideUniqueToGene,ExperimentDesc,ExpID,PubmedID,ScoreType,IdentScore,LocProb,Log2FChange,PQ-val,QuantSig,PEP,MassErrorPPM
PPAASQRYPSPSQPSGKSEVSDLKTQL,nt,P,3,true,"Arabidopsis translation initiation landscape - NT",167b,35069635,,,,,,,,
PAASQRYPSPSQPSGKSEVSDLKTQL,nt,P,4,true,"Arabidopsis translation initiation landscape - NT",167b,35069635,,,,,,,,
YPSPSQPSGK,ph,S,12,true,"SnRK2 protein kinase substrates",85,23776212,XCorr,2.3706672,0.9920000,,,,0.030682399868965,
YPSPSQPSGK,ph,S,12,true,"atm and atr DNA damage response",88,25561503,"MASCOT Score",37.0000000,1.0000000,,,,,-1.1800000
YPSPSQPSGK,ph,S,12,true,"TOR Kinase and ABA Receptor",100,29290610,XCorr,3.0034311,0.9751000,,,,0.00060089997714385,
YPSPSQPSGK,ph,S,12,true,"Lateral root-induction - NAA vs control",106,23328941,"MASCOT Score",34.0000000,,0.1962507,0.4677515,NO,,
YPSPSQPSGK,ph,S,12,true,"Phospho cell culture sucrose/TOR",109,30833711,,,0.9991380,,,,,
YPSPSQPSGK,ph,S,12,true,"Tissue atlas Arabidopsis - ProteomicsDB",114,32188942,"MaxQuant score",232.4800000,0.9999910,,,,1.422260006006E-36,
HFYCQYNEPSYVK,so,C,346,true,"Arabidopsis S-sulfenylation chemoproteomics",108,31578252,"pFind PSM Score",0.0359086,,,,,,-1.2524662
KYPQWSHDCISVVGGISSK,so,C,447,true,"S-sulfenylation site detection using YAP1C",110,32714340,,,,,,,,
VVSPPKQAVSVFADTQSSEIKDR,ph,S,562,true,"Tissue atlas Arabidopsis - ProteomicsDB",114,32188942,"MaxQuant score",131.8100000,0.9999120,,,,2.8015398500549E-29,
