Peptide,PTM,ModifiedAA,ModifiedPosition,PeptideUniqueToGene,ExperimentDesc,ExpID,PubmedID,ScoreType,IdentScore,LocProb,Log2FChange,PQ-val,QuantSig,PEP,MassErrorPPM
FSDGMLPNGDFE,nt,F,23,true,"Arg/N-end rule seed, prt6 vs. Wt",99,29168982,"MASCOT Score",51.1900000,,0.1480557,0.5370544,NO,3.2600000849925E-5,-2.4788802
FSDGMLPNGDFE,nt,F,23,true,"HUNTER N-terminome: legumain, GluC and trypsin",119,31951383,"MaxQuant score",151.2200000,,,,,,
LGNEASIKQR,ac,K,94,false,"Quantitative Acetylproteomics",101,29440448,,,,,,,,
LGNEASIKQR,ub,K,94,false,"Arabidopsis ubiquitination COFRADIC",40,26744219,"MaxQuant Score",66.0560000,1.0000000,,,,0.0049999998882413,0.1850000
TCAQDER,ox,C,115,false,"OxiTRAQ Arabidopsis - 5 mM H2O2 versus control",47,24376095,,,,-0.2965024,0.1230976,NO,,
NGGFEEGPYVLPNATTGVLVPPFIEDDHSPLPAWMVESLK,ng,N,209,true,"Conserved N-glycosylation",74,22633491,"MaxQuant Score",203.5800000,1.0000000,,,,0,0.5010000
AVELVAGKESAIAQVAR,cr,K,261,true,"Open search Plant PTM Viewer 2.0 - Crotonylation",164c,TBA,,,,,,,,
SDDFSSLCGPVIDDVK,acy,C,351,false,"Arabidopsis S-acylation atlas - Hypocotyl",163b,35681017,,,,,,,,
SDDFSSLCGPVIDDVK,sno,C,351,false,"hot5-4 / wildtype, FAT-switch S-nitrosoproteome",169,37277371,,,,0.4598352,0.0107941,NO,,
