Peptide,PTM,ModifiedAA,ModifiedPosition,PeptideUniqueToGene,ExperimentDesc,ExpID,PubmedID,ScoreType,IdentScore,LocProb,Log2FChange,PQ-val,QuantSig,PEP,MassErrorPPM
SSGKDKVSDAR,ub,K,26,true,"Arabidopsis ubiquitination COFRADIC",40,26744219,"MaxQuant Score",96.5510000,1.0000000,,,,0.00013669999316335,-0.1460000
VFYEDGDKETLDLKKER,ub,K,76,true,"Arabidopsis ubiquitination COFRADIC",40,26744219,"MaxQuant Score",77.2210000,1.0000000,,,,1.7279999653397E-9,0.8860000
HTDDQDEDEEAGDDIDTSSEEAKPK,ph,T,231,true,"srk2dei ABA signaling phopshoproteomics",83,23572148,"MASCOT Score",85.0000000,,,,,,-0.0024000
HTDDQDEDEEAGDDIDTSSEEAKPK,ph,T,231,true,"LAXIC - mannitol vs control",84b,23660473,XCorr,7.5600000,0.9910000,,,,4.3499999046065E-16,
HTDDQDEDEEAGDDIDTSSEEAKPK,ph,T,231,true,"Tissue atlas Arabidopsis - ProteomicsDB",114,32188942,"MaxQuant score",170.1500000,0.9998360,,,,0,
HTDDQDEDEEAGDDIDTSSEEAKPK,ph,S,232,true,"srk2dei ABA signaling phopshoproteomics",83,23572148,"MASCOT Score",76.0000000,,,,,,-0.0023000
HTDDQDEDEEAGDDIDTSSEEAKPK,ph,S,232,true,"LAXIC - mannitol vs control",84b,23660473,XCorr,7.5600000,0.9150000,,,,4.3499999046065E-16,
HTDDQDEDEEAGDDIDTSSEEAKPK,ph,S,232,true,"TOR Kinase and ABA Receptor",100,29290610,XCorr,7.1073580,0.9300000,,,,1.7139999499705E-6,
HTDDQDEDEEAGDDIDTSSEEAKPK,ph,S,232,true,"Tissue atlas Arabidopsis - ProteomicsDB",114,32188942,"MaxQuant score",228.0000000,0.9998290,,,,0,
HTDDQDEDEEAGDDIDTSSEEAKPK,ph,S,233,true,"srk2dei ABA signaling phopshoproteomics",83,23572148,"MASCOT Score",85.0000000,,,,,,-0.0024000
HTDDQDEDEEAGDDIDTSSEEAKPK,ph,S,233,true,"SnRK2 protein kinase substrates",85,23776212,XCorr,7.0497146,0.9140000,,,,0.00016706700262148,
HTDDQDEDEEAGDDIDTSSEEAKPK,ph,S,233,true,"TOR Kinase and ABA Receptor",100,29290610,XCorr,7.2713604,0.9188000,,,,4.9659998335727E-10,
HTDDQDEDEEAGDDIDTSSEEAKPK,ph,S,233,true,"Tissue atlas Arabidopsis - ProteomicsDB",114,32188942,"MaxQuant score",217.5400000,0.9998290,,,,0,
SCNSNADEVAENSSDEDEPK,ph,S,255,true,"STN8 phosphoproteome",38,21768351,"MASCOT Score",78.4100000,,,,,,
SCNSNADEVAENSSDEDEPK,ph,S,255,true,"LAXIC - mannitol vs control",84b,23660473,XCorr,4.3700000,0.9950000,,,,5.68999986017E-11,
SCNSNADEVAENSSDEDEPK,ph,S,255,true,"SnRK2 protein kinase substrates",85,23776212,XCorr,5.5072823,0.9670000,,,,0.00036727200495079,
SCNSNADEVAENSSDEDEPK,ph,S,255,true,"atm and atr DNA damage response",88,25561503,"MASCOT Score",48.0000000,1.0000000,,,,,2.1800000
SCNSNADEVAENSSDEDEPK,ph,S,255,true,"TOR Kinase and ABA Receptor",100,29290610,XCorr,4.5890861,0.9998000,,,,8.9929999376182E-6,
SCNSNADEVAENSSDEDEPK,ph,S,255,true,"Lateral root-induction - NAA vs control",106,23328941,"MASCOT Score",56.0000000,,,,,,
SCNSNADEVAENSSDEDEPK,ph,S,256,true,"atm and atr DNA damage response",88,25561503,"MASCOT Score",48.0000000,1.0000000,,,,,2.1800000
SCNSNADEVAENSSDEDEPK,ph,S,256,true,"TOR Kinase and ABA Receptor",100,29290610,XCorr,4.5890861,0.9998000,,,,8.9929999376182E-6,
SCNSNADEVAENSSDEDEPK,ph,S,256,true,"Lateral root-induction - NAA vs control",106,23328941,"MASCOT Score",26.0000000,,,,,,
TNNSKADKDEDEEENETSDDEAEPK,ph,T,282,true,"STN8 phosphoproteome",38,21768351,"MASCOT Score",57.1800000,,,,,,
ADKDEDEEENETSDDEAEPK,ph,T,282,true,"STN8 phosphoproteome",38,21768351,"MASCOT Score",80.7900000,,,,,,
ADKDEDEEENETSDDEAEPK,ph,T,282,true,"Pollen phosphoproteome Arabidopsis",43,22631563,"MASCOT Score",45.0600000,,,,,,-2.1189500
ADKDEDEEENETSDDEAEPK,ph,T,282,true,"Large-scale phosphorylation discovery",44,23111157,XCorr,4.2480000,,,,,,
ADKDEDEEENETSDDEAEPK,ph,T,282,true,"LAXIC - mannitol vs control",84b,23660473,XCorr,5.2100000,1.0000000,,,,1.3899999657951E-6,
ADKDEDEEENETSDDEAEPK,ph,T,282,true,"TOR Kinase and ABA Receptor",100,29290610,XCorr,5.4906030,1.0000000,,,,0.00010810000094352,
DEDEEENETSDDEAEPK,ph,T,282,true,"STN8 phosphoproteome",38,21768351,"MASCOT Score",54.8000000,,,,,,
ADKDEDEEENETSDDEAEPK,ph,S,283,true,"Pollen phosphoproteome Arabidopsis",43,22631563,"MASCOT Score",45.0600000,,,,,,-2.1189500
ADKDEDEEENETSDDEAEPK,ph,S,283,true,"Large-scale phosphorylation discovery",44,23111157,XCorr,4.2480000,,,,,,
ADKDEDEEENETSDDEAEPK,ph,S,283,true,"LAXIC - mannitol vs control",84b,23660473,XCorr,5.2100000,1.0000000,,,,1.3899999657951E-6,
ADKDEDEEENETSDDEAEPK,ph,S,283,true,"SnRK2 protein kinase substrates",85,23776212,XCorr,5.3023334,0.9980000,,,,0.0015735999913886,
ADKDEDEEENETSDDEAEPK,ph,S,283,true,"TOR Kinase and ABA Receptor",100,29290610,XCorr,5.4906030,1.0000000,,,,0.00010810000094352,
LSNSNSDNGENNSSDDEKEITISK,ph,S,299,true,"STN8 phosphoproteome",38,21768351,"MASCOT Score",56.9300000,,,,,,
LSNSNSDNGENNSSDDEKEITISK,ph,S,299,true,"Tissue atlas Arabidopsis - ProteomicsDB",114,32188942,"MaxQuant score",72.1670000,0.8877240,,,,1.9665300499128E-8,
LSNSNSDNGENNSSDDEKEITISK,ph,S,306,true,"Tissue atlas Arabidopsis - ProteomicsDB",114,32188942,"MaxQuant score",220.6600000,0.9999800,,,,0,
LSNSNSDNGENNSSDDEKEITISK,ph,S,307,true,"Tissue atlas Arabidopsis - ProteomicsDB",114,32188942,"MaxQuant score",254.5100000,0.9999070,,,,0,
SNTADEENGDNEDGEKAVDEMSDGEPLVSFLK,ph,S,346,true,"SnRK2 protein kinase substrates",85,23776212,XCorr,3.8612051,0.9910000,,,,3.1183799591622E-15,
AVDEMSDGEPLVSFLKK,ph,S,346,true,"Chloroplast kinase substrates",60,19376835,"MASCOT Score",56.8800000,,,,,,-0.8386660
AVDEMSDGEPLVSFLKK,ph,S,346,true,"Tissue atlas Arabidopsis - ProteomicsDB",114,32188942,"MaxQuant score",336.0100000,1.0000000,,,,0,
AVDEMSDGEPLVSFLK,ph,S,346,true,"Phosphorylation nuclei-enriched fractions",28,19245862,,,,,,,,
AVDEMSDGEPLVSFLK,ph,S,346,true,"Tyrosine phosphorylation in Arabidopsis",59,18463617,"MASCOT Score",40.0000000,,,,,,-2.0198808
AVDEMSDGEPLVSFLK,ph,S,346,true,"srk2dei ABA signaling phopshoproteomics",83,23572148,"MASCOT Score",60.0000000,,,,,,-0.0004000
AVDEMSDGEPLVSFLK,ph,S,346,true,"LAXIC - ABA stress",84a,23660473,XCorr,3.7600000,1.0000000,,,,0.017923399806023,
AVDEMSDGEPLVSFLK,ph,S,346,true,"LAXIC - mannitol vs control",84b,23660473,XCorr,3.6500000,1.0000000,,,,0.00060027302242815,
AVDEMSDGEPLVSFLK,ph,S,346,true,"SnRK2 protein kinase substrates",85,23776212,XCorr,4.1759853,1.0000000,,,,0.00029924401314929,
AVDEMSDGEPLVSFLK,ph,S,346,true,"atm and atr DNA damage response",88,25561503,"MASCOT Score",48.0000000,1.0000000,,,,,0.4100000
AVDEMSDGEPLVSFLK,ph,S,346,true,"TOR Kinase and ABA Receptor",100,29290610,XCorr,5.9824729,1.0000000,,,,1.0630000213396E-9,
AVDEMSDGEPLVSFLK,ph,S,346,true,"Lateral root-induction - NAA vs control",106,23328941,"MASCOT Score",29.0000000,,,,,,
AVDEMSDGEPLVSFLK,ph,S,346,true,"Phospho cell culture sucrose/TOR",109,30833711,,,0.9996430,,,,,
KSPEGIDAK,ph,S,358,true,"SnRK2 protein kinase substrates",85,23776212,XCorr,2.4662948,1.0000000,,,,0.042296800762415,
KSPEGIDAK,ph,S,358,true,"atm and atr DNA damage response",88,25561503,"MASCOT Score",50.0000000,1.0000000,,,,,2.0600000
KSPEGIDAK,ph,S,358,true,"Phospho cell culture sucrose/TOR",109,30833711,,,1.0000000,,,,,
SPEGIDAK,ph,S,358,true,"STN8 phosphoproteome",38,21768351,"MASCOT Score",36.1300000,,,,,,-0.1096330
SPEGIDAK,ph,S,358,true,"atm and atr DNA damage response",88,25561503,"MASCOT Score",30.0000000,1.0000000,,,,,0.0800000
SPEGIDAK,ph,S,358,true,"Tissue atlas Arabidopsis - ProteomicsDB",114,32188942,"MaxQuant score",101.3500000,1.0000000,,,,0.00081245001638308,
