Peptide,PTM,ModifiedAA,ModifiedPosition,PeptideUniqueToGene,ExperimentDesc,ExpID,PubmedID,ScoreType,IdentScore,LocProb,Log2FChange,PQ-val,QuantSig,PEP,MassErrorPPM
ESTQPARMEESGFESTTISDVMKSKGKSAD,nt,E,40,true,"HUNTER N-terminome: legumain, GluC and trypsin",119,31951383,"MaxQuant score",98.6320000,,,,,,
ESTQPARMEESGFESTTISD,nt,E,40,true,"HUNTER N-terminome: legumain, GluC and trypsin",119,31951383,"MaxQuant score",67.2340000,,,,,,
ESTQPARMEESGFESTTIS,nt,E,40,true,"Arabidopsis translation initiation landscape - NT",167b,35069635,,,,,,,,
ESTQPARMEESGFEST,nt,E,40,true,"N-terminal ChaFRADIC",92,26010716,"MASCOT Score",22.7400000,,,,,0.00089500000467524,
ESTQPARME,nt,E,40,true,"Arg/N-end rule seed, prt6 vs. Wt",99,29168982,"MASCOT Score",23.5500000,,-0.3914522,0.0080983,NO,0.010370000265539,-2.2801552
MEESGFESTTISDVMKSK,ac,K,62,true,"Quantitative Acetylproteomics",101,29440448,,,,,,,,
SADGSWLWCTTDDTVYDAVK,sno,C,75,true,"Site-specific nitrosomeproteomic id - gsnor1-3",90a,25699590,XCorr,3.3275974,,,,,4.2899999243673E-5,-2.4172803
SADGSWLWCTTDDTVYDAVK,sno,C,75,true,"Site-specific nitrosomeproteomic id - gsnor1-3",90b,25699590,XCorr,3.4300000,,,,,0.00070299999788404,-6.6000000
SADGSWLWCTTDDTVYDAVK,so,C,75,true,"S-sulfenylation site detection using YAP1C",110,32714340,,,,,,,,
STKVGDIMTEENK,ac,K,131,true,"Quantitative Acetylproteomics",101,29440448,,,,,,,,
KLITVTPETKVLR,nt,K,141,true,"Arabidopsis translation initiation landscape - NT",167b,35069635,,,,,,,,
LITVTPETKVLR,ac,K,150,true,"Quantitative Acetylproteomics",101,29440448,,,,,,,,
HIPVIKDK,ac,K,170,true,"Quantitative Acetylproteomics",101,29440448,,,,,,,,
