Peptide,PTM,ModifiedAA,ModifiedPosition,PeptideUniqueToGene,ExperimentDesc,ExpID,PubmedID,ScoreType,IdentScore,LocProb,Log2FChange,PQ-val,QuantSig,PEP,MassErrorPPM
FYLPGVAPQDFEKGDE,nt,F,34,false,"HUNTER N-terminome: legumain, GluC and trypsin",119,31951383,"MaxQuant score",74.9440000,,,,,,
FYLPGVAPQDFEKGDE,nt,F,34,false,"Arabidopsis translation initiation landscape - NT",167b,35069635,,,,,,,,
FYLPGVAPQD,nt,F,34,false,"HUNTER N-terminome: legumain, GluC and trypsin",119,31951383,"MaxQuant score",102.7200000,,,,,,
MREAQMCNILGR,ox,C,110,true,"OxiTRAQ Arabidopsis - 5 mM H2O2 versus control",47,24376095,,,,-0.1199633,0.2733471,NO,,
EAQMCNILGR,ox,C,110,true,"OxiTRAQ Arabidopsis - 5 mM H2O2 versus control",47,24376095,,,,-0.2034086,0.1586182,NO,,
EAQMCNILGR,ox,C,110,true,"Bicarbonate Induced Redox Changes - 30 min",117b,28184230,,,,0.1243281,,YES,,
EAQMCNILGR,sno,C,110,true,"hot5-4 / wildtype, FAT-switch S-nitrosoproteome",169,37277371,,,,0.3685355,0.0691832,NO,,
GQYEGSKEQK,ac,K,177,false,"Histone deacetylases- hda14 vs WT (low light)",98c,29061669,"MaxQuant Score",155.9700000,1.0000000,0.4070000,0.9885531,NO,0.00050999998347834,
LTTCDPHTK,acy,C,231,false,"Arabidopsis S-acylation atlas - Silique",163e,35681017,,,,,,,,
LTTCDPHTKR,ox,C,231,false,"OxiTRAQ Arabidopsis - 5 mM H2O2 versus control",47,24376095,,,,-0.1435946,0.1457621,NO,,
LTTCDPHTK,ox,C,231,false,"OxiTRAQ Arabidopsis - 5 mM H2O2 versus control",47,24376095,,,,-0.1490996,0.2215212,NO,,
LTTCDPHTK,sno,C,231,false,"hot5-4 / wildtype, FAT-switch S-nitrosoproteome",169,37277371,,,,,,,,
