Peptide,PTM,ModifiedAA,ModifiedPosition,PeptideUniqueToGene,ExperimentDesc,ExpID,PubmedID,ScoreType,IdentScore,LocProb,Log2FChange,PQ-val,QuantSig,PEP,MassErrorPPM
RSSMEDFFETR,ph,S,45,false,"Tissue atlas Arabidopsis - ProteomicsDB",114,32188942,"MaxQuant score",131.0600000,0.9946380,,,,1.3070399518256E-6,
SASSSHISSSSSK,ph,S,293,true,"Tissue atlas Arabidopsis - ProteomicsDB",114,32188942,"MaxQuant score",144.5700000,0.8051840,,,,2.0271100076297E-10,
SASSSHISSSSSKEAK,ph,S,295,true,"Tissue atlas Arabidopsis - ProteomicsDB",114,32188942,"MaxQuant score",178.5400000,0.9045990,,,,6.2999999597925E-27,
EMPPLGDLAISSNEAK,ph,S,310,true,"Tissue atlas Arabidopsis - ProteomicsDB",114,32188942,"MaxQuant score",87.6760000,0.8177350,,,,0.0001732200034894,
EMPPLGDLAISSNEAK,ph,S,311,true,"Tissue atlas Arabidopsis - ProteomicsDB",114,32188942,"MaxQuant score",175.4800000,0.8856470,,,,1.0033499851229E-19,
QVQIGSGNKPENVTNR,ph,S,321,true,"Tissue atlas Arabidopsis - ProteomicsDB",114,32188942,"MaxQuant score",154.4600000,1.0000000,,,,3.091819877378E-13,
QVQIGSGNKPENVTNRKPDTASR,fuc,T,335,true,"SPINDLY O-fucosylation",162,36739885,,,,,,,0.11999999731779,
QVQIGSGNKPENVTNRKPDTASR,fuc,S,337,true,"SPINDLY O-fucosylation",162,36739885,,,,,,,0.6700000166893,
STDTLTLER,ph,S,339,true,"Tissue atlas Arabidopsis - ProteomicsDB",114,32188942,"MaxQuant score",76.9270000,0.8652560,,,,0.0058008502237499,
STDTLTLER,ph,T,342,true,"Tissue atlas Arabidopsis - ProteomicsDB",114,32188942,"MaxQuant score",100.8800000,0.9999330,,,,0.0030456900130957,
STDTLTLER,ph,T,344,true,"Tissue atlas Arabidopsis - ProteomicsDB",114,32188942,"MaxQuant score",149.2300000,0.9999870,,,,0.00027078099083155,
NSVTDKV,ph,S,349,true,"Tissue atlas Arabidopsis - ProteomicsDB",114,32188942,"MaxQuant score",235.1100000,0.9994340,,,,0,
