Peptide,PTM,ModifiedAA,ModifiedPosition,PeptideUniqueToGene,ExperimentDesc,ExpID,PubmedID,ScoreType,IdentScore,LocProb,Log2FChange,PQ-val,QuantSig,PEP,MassErrorPPM
ASEDTLSSNPLLQNFDFPPFDSVDAHHVRPGIR,nta,A,2,true,"Arg/N-end rule pathway Roots",80,25728785,"MASCOT Score",35.9400000,,,,,4.7339998587859E-9,
ASEDTLSSNPLLQNFDFPPFDSVDAHHVRPGIR,nta,A,2,true,"HUNTER N-terminome: legumain, GluC and trypsin",119,31951383,"MaxQuant score",119.1800000,,,,,,
ASEDTLSSNPLLQNFDFPPFDSVDAHHVR,nta,A,2,true,"HUNTER N-terminome: legumain, GluC and trypsin",119,31951383,"MaxQuant score",44.8110000,,,,,,
ASEDTLSSNPLLQNFD,nta,A,2,true,"Arabidopsis translation initiation landscape - NTA",167a,35069635,,,,,,,,
ASEDTLSSNPLLQNF,nta,A,2,true,"Characterization plant N-terminal acetylation",6,22223895,"MASCOT Score",49.2400000,,,,,,
ASEDTLSSNPLLQN,nta,A,2,true,"HUNTER N-terminome: legumain, GluC and trypsin",119,31951383,"MaxQuant score",192.5000000,,,,,,
LVEPLEKIIDR,ub,K,64,true,"upl3 mutant / wildtype",168,35926874,"MaxQuant score",81.9200000,1.0000000,-0.4500844,0.3377800,NO,0.001245960011147,-0.1310000
SKPIYNAFKAIRE,nt,S,109,false,"Arabidopsis translation initiation landscape - NT",167b,35069635,,,,,,,,
LSHKFSENVLDATK,ac,K,171,false,"Quantitative Acetylproteomics",101,29440448,,,,,,,,
FSENVLDATKK,ub,K,181,false,"upl3 mutant / wildtype",168,35926874,"MaxQuant score",119.3900000,1.0000000,1.0600474,0.3283000,NO,5.8579698816175E-5,0.2789900
ASSGDLDNTAIIDQILK,ph,S,257,false,"LAXIC - mannitol vs control",84b,23660473,XCorr,3.7000000,0.9170000,,,,3.7200000857496E-9,
ASSGDLDNTAIIDQILK,ph,S,258,false,"srk2dei ABA signaling phopshoproteomics",83,23572148,"MASCOT Score",94.0000000,,,,,,0.0027000
ASSGDLDNTAIIDQILK,ph,S,258,false,"SnRK2 protein kinase substrates",85,23776212,XCorr,4.0894566,0.9070000,,,,2.5003899395415E-8,
ASSGDLDNTAIIDQILK,ph,S,258,false,"TOR Kinase and ABA Receptor",100,29290610,XCorr,4.6580429,0.9781000,,,,3.0319999495987E-5,
LRLEKAK,ac,K,277,false,"Quantitative Acetylproteomics",101,29440448,,,,,,,,
LEKAKLLGYR,ub,K,279,true,"Arabidopsis ubiquitination COFRADIC",40,26744219,"MaxQuant Score",49.3000000,0.9930000,,,,0.012000000104308,-2.3360000
GREPSPEPLLR,ph,S,686,false,"Phosphoproteome ethylene-regulated time response",46,24043427,"MASCOT Score",33.8500000,,,,,,8.0613000
GREPSPEPLLR,ph,S,686,false,"Tyrosine phosphorylation in Arabidopsis",59,18463617,"MASCOT Score",33.0000000,,,,,,-0.7520814
GREPSPEPLLR,ph,S,686,false,"SnRK2 protein kinase substrates",85,23776212,XCorr,2.7120550,1.0000000,,,,0.006633410230279,
GREPSPEPLLR,ph,S,686,false,"atm and atr DNA damage response",88,25561503,"MASCOT Score",38.0000000,1.0000000,,,,,0.2100000
GREPSPEPLLR,ph,S,686,false,"TOR Kinase and ABA Receptor",100,29290610,XCorr,3.1995292,1.0000000,,,,0.017990000545979,
GREPSPEPLLR,ph,S,686,false,"Phospho cell culture sucrose/TOR",109,30833711,,,1.0000000,,,,,
GREPSPEPLLR,ph,S,686,false,"Tissue atlas Arabidopsis - ProteomicsDB",114,32188942,"MaxQuant score",151.9900000,1.0000000,,,,1.7940500640634E-8,
