Peptide,PTM,ModifiedAA,ModifiedPosition,PeptideUniqueToGene,ExperimentDesc,ExpID,PubmedID,ScoreType,IdentScore,LocProb,Log2FChange,PQ-val,QuantSig,PEP,MassErrorPPM
TNRWNWEVSGFEPR,ph,T,8,true,"TOR Kinase and ABA Receptor",100,29290610,XCorr,2.6402972,1.0000000,,,,0.0077630002051592,
SSSNASFAESTGHR,ph,S,23,true,"TOR Kinase and ABA Receptor",100,29290610,XCorr,3.8291092,0.8871000,,,,0.0010639999527484,
KSSSNASFAESTGHRTTGPLLR,fuc,S,25,true,"SPINDLY O-fucosylation",162,36739885,,,,,,,0.58999997377396,
KSSSNASFAESTGHR,fuc,S,25,true,"SPINDLY O-fucosylation",162,36739885,,,,,,,-0.61000001430511,
SSSNASFAESTGHR,fuc,S,25,true,"SPINDLY O-fucosylation",162,36739885,,,,,,,-0.6700000166893,
SSSNASFAESTGHR,ph,S,28,true,"atm and atr DNA damage response",88,25561503,"MASCOT Score",82.0000000,1.0000000,,,,,0.0200000
SSSNASFAESTGHR,ph,S,28,true,"Tissue atlas Arabidopsis - ProteomicsDB",114,32188942,"MaxQuant score",101.0400000,0.9946040,,,,3.5993300116388E-5,
RNSISTPSLPPK,ph,S,46,true,"STN8 phosphoproteome",38,21768351,"MASCOT Score",43.3500000,,,,,,-1.3554300
RNSISTPSLPPK,ph,S,46,true,"Chloroplast kinase substrates",60,19376835,"MASCOT Score",40.7000000,,,,,,-0.5570020
RNSISTPSLPPK,ph,S,46,true,"srk2dei ABA signaling phopshoproteomics",83,23572148,"MASCOT Score",57.0000000,,,,,,-0.0003000
RNSISTPSLPPK,ph,S,46,true,"SnRK2 protein kinase substrates",85,23776212,XCorr,2.1785150,0.9920000,,,,0.049616400152445,
RNSISTPSLPPK,ph,S,46,true,"atm and atr DNA damage response",88,25561503,"MASCOT Score",57.0000000,1.0000000,,,,,-0.9400000
RNSISTPSLPPK,ph,S,46,true,"Phospho cell culture sucrose/TOR",109,30833711,,,0.9975600,,,,,
RNSISTPSLPPK,ph,S,46,true,"Tissue atlas Arabidopsis - ProteomicsDB",114,32188942,"MaxQuant score",184.7600000,0.9998780,,,,4.5088600601545E-20,
RNSISTPSLPPK,ph,S,46,true,"Touch-induced phosphorylation: 40s touch vs untouc",136,30291188,"MASCOT score",53.7300000,,2.2154520,0.0003163,YES,,6.4841768
NSISTPSLPPK,ph,S,46,true,"atm and atr DNA damage response",88,25561503,"MASCOT Score",56.0000000,1.0000000,,,,,-1.1200000
RNSISTPSLPPK,ph,T,49,true,"srk2dei ABA signaling phopshoproteomics",83,23572148,"MASCOT Score",47.0000000,,,,,,-0.0006000
QEATDLQEYSNAKLDR,nt,Q,81,true,"HUNTER N-terminome: legumain, GluC and trypsin",119,31951383,"MaxQuant score",60.6280000,,,,,,
ISPLINEK,ph,S,123,false,"atm and atr DNA damage response",88,25561503,"MASCOT Score",40.0000000,1.0000000,,,,,-1.2900000
SENIMLVDKHR,ac,K,539,true,"Quantitative Acetylproteomics",101,29440448,,,,,,,,
TGDALQSQDIFSPIPK,ph,S,606,true,"Phosphorylation Early Elicitor Signaling",23,17317660,,,,,,,,
TGDALQSQDIFSPIPK,ph,S,611,true,"Tissue atlas Arabidopsis - ProteomicsDB",114,32188942,"MaxQuant score",232.6200000,1.0000000,,,,0,
SMAVSTQVLSPSLR,ph,S,668,true,"Phosphorylation Early Elicitor Signaling",23,17317660,,,,,,,,
SMAVSTQVLSPSLR,ph,S,668,true,"Phosphoproteome ethylene-regulated time response",46,24043427,"MASCOT Score",63.2500000,,,,,,9.7523000
SMAVSTQVLSPSLR,ph,S,668,true,"srk2dei ABA signaling phopshoproteomics",83,23572148,"MASCOT Score",46.0000000,,,,,,-0.0002000
SMAVSTQVLSPSLR,ph,S,668,true,"atm and atr DNA damage response",88,25561503,"MASCOT Score",62.0000000,0.9930000,,,,,-0.0300000
SMAVSTQVLSPSLR,ph,S,668,true,"TOR Kinase and ABA Receptor",100,29290610,XCorr,4.9577322,0.9993000,,,,6.7400002023987E-8,
SMAVSTQVLSPSLR,ph,S,668,true,"Lateral root-induction - NAA vs control",106,23328941,"MASCOT Score",38.0000000,,0.1407165,0.6198472,NO,,
SMAVSTQVLSPSLR,ph,S,668,true,"Phospho cell culture sucrose/TOR",109,30833711,,,0.9668960,,,,,
SMAVSTQVLSPSLR,ph,S,668,true,"Tissue atlas Arabidopsis - ProteomicsDB",114,32188942,"MaxQuant score",281.1400000,0.9973940,,,,0,
SMAVSTQVLSPSLR,ph,S,668,true,"Touch-induced phosphorylation: 40s touch vs untouc",136,30291188,"MASCOT score",95.2500000,,-0.0942621,0.8331373,NO,,2.3689423
SMAVSTQVLSPSLRASPNIQPANVNR,ph,S,670,true,"Tissue atlas Arabidopsis - ProteomicsDB",114,32188942,"MaxQuant score",202.1400000,0.8646640,,,,0,
SMAVSTQVLSPSLR,ph,S,670,true,"srk2dei ABA signaling phopshoproteomics",83,23572148,"MASCOT Score",24.0000000,,,,,,0.0011000
SMAVSTQVLSPSLRASPNIQPANVNR,ph,S,674,true,"TOR Kinase and ABA Receptor",100,29290610,XCorr,4.5517039,0.9947000,,,,8.3539998740889E-6,
ASPNIQPANVNR,ph,S,674,true,"STN8 phosphoproteome",38,21768351,"MASCOT Score",56.1400000,,,,,,-0.4108140
ASPNIQPANVNR,ph,S,674,true,"Tyrosine phosphorylation in Arabidopsis",59,18463617,"MASCOT Score",56.0000000,,,,,,-0.7354951
ASPNIQPANVNR,ph,S,674,true,"atm and atr DNA damage response",88,25561503,"MASCOT Score",62.0000000,1.0000000,,,,,0.0200000
ASPNIQPANVNR,ph,S,674,true,"Phospho cell culture sucrose/TOR",109,30833711,,,1.0000000,,,,,
ASPNIQPANVNR,ph,S,674,true,"Tissue atlas Arabidopsis - ProteomicsDB",114,32188942,"MaxQuant score",217.0700000,1.0000000,,,,0,
GEGYSAEAVALPSTPNKNNGAITLVK,ph,S,697,true,"Tissue atlas Arabidopsis - ProteomicsDB",114,32188942,"MaxQuant score",176.9000000,0.8539170,,,,0,
GEGYSAEAVALPSTPNK,ph,S,697,true,"srk2dei ABA signaling phopshoproteomics",83,23572148,"MASCOT Score",88.0000000,,,,,,-0.0009000
GEGYSAEAVALPSTPNK,ph,S,697,true,"Lateral root-induction - NAA vs control",106,23328941,"MASCOT Score",33.0000000,,,,,,
GEGYSAEAVALPSTPNKNNGAITLVK,ph,T,698,true,"Tissue atlas Arabidopsis - ProteomicsDB",114,32188942,"MaxQuant score",306.7200000,0.9580040,,,,0,
GEGYSAEAVALPSTPNK,ph,T,698,true,"srk2dei ABA signaling phopshoproteomics",83,23572148,"MASCOT Score",82.0000000,,,,,,0.0001000
GEGYSAEAVALPSTPNK,ph,T,698,true,"atm and atr DNA damage response",88,25561503,"MASCOT Score",43.0000000,1.0000000,,,,,1.1700000
GEGYSAEAVALPSTPNK,ph,T,698,true,"Phospho cell culture sucrose/TOR",109,30833711,,,0.7947580,,,,,
VSPVECFLEKPNTGR,sno,C,823,true,"Site-specific nitrosomeproteomic id - gsnor1-3",90b,25699590,XCorr,3.0700000,,,,,0.1397999972105,-5.9200000
VSPVECFLEKPNTGR,sno,C,823,true,"hot5-4 / wildtype, FAT-switch S-nitrosoproteome",169,37277371,,,,0.4375983,0.0250565,NO,,
VSPVECFLEKPNTGR,so,C,823,true,"S-sulfenylation site detection using YAP1C",110,32714340,,,,,,,,
GSSPGRSPVRYLDTQIHGFK,ph,S,841,true,"TOR Kinase and ABA Receptor",100,29290610,XCorr,2.8560340,0.8352000,,,,0.013810000382364,
GSSPGRSPVR,ph,S,841,true,"Chloroplast kinase substrates",60,19376835,"MASCOT Score",38.1000000,,,,,,-0.4029430
GSSPGRSPVRYLDTQIHGFK,ph,S,845,true,"TOR Kinase and ABA Receptor",100,29290610,XCorr,2.8560340,0.9848000,,,,0.013810000382364,
GSSPGRSPVR,ph,S,845,true,"atm and atr DNA damage response",88,25561503,"MASCOT Score",26.0000000,0.9990000,,,,,0.0200000
SALESVDHKR,ac,K,1028,false,"Quantitative Acetylproteomics",101,29440448,,,,,,,,
SDAALLNLEEGSSPIPNPSTAAEDSR,ph,S,1049,true,"Lateral root-induction - NAA vs control",106,23328941,"MASCOT Score",55.0000000,,,,,,
SDAALLNLEEGSSPIPNPSTAAEDSR,ph,S,1050,true,"Large-scale phosphorylation discovery",44,23111157,XCorr,4.9370000,,,,,,
SDAALLNLEEGSSPIPNPSTAAEDSR,ph,S,1050,true,"srk2dei ABA signaling phopshoproteomics",83,23572148,"MASCOT Score",61.0000000,,,,,,-0.0013000
SDAALLNLEEGSSPIPNPSTAAEDSR,ph,S,1050,true,"LAXIC - ABA stress",84a,23660473,XCorr,4.6600000,0.8490000,,,,0.00026897998759523,
SDAALLNLEEGSSPIPNPSTAAEDSR,ph,S,1050,true,"LAXIC - mannitol vs control",84b,23660473,XCorr,4.0800000,0.8460000,,,,0.00046028601354919,
SDAALLNLEEGSSPIPNPSTAAEDSR,ph,S,1050,true,"SnRK2 protein kinase substrates",85,23776212,XCorr,4.5891771,0.9890000,,,,0.0052340598776937,
SDAALLNLEEGSSPIPNPSTAAEDSR,ph,S,1050,true,"TOR Kinase and ABA Receptor",100,29290610,XCorr,4.7112608,0.9352000,,,,1.1379999705241E-5,
SDAALLNLEEGSSPIPNPSTAAEDSR,ph,S,1050,true,"Lateral root-induction - NAA vs control",106,23328941,"MASCOT Score",32.0000000,,,,,,
SDAALLNLEEGSSPIPNPSTAAEDSR,ph,S,1062,true,"srk2dei ABA signaling phopshoproteomics",83,23572148,"MASCOT Score",43.0000000,,,,,,0.0003000
MPSLLDIDHPCAQR,so,C,1118,true,"Arabidopsis S-sulfenylation chemoproteomics",108,31578252,"pFind PSM Score",0.0000323,,0.8696300,,,,-1.4941197
VPSLKDLVSELE,ph,S,1264,true,"SnRK2 protein kinase substrates",85,23776212,XCorr,2.5333810,1.0000000,,,,0.028706900775433,
