Peptide,PTM,ModifiedAA,ModifiedPosition,PeptideUniqueToGene,ExperimentDesc,ExpID,PubmedID,ScoreType,IdentScore,LocProb,Log2FChange,PQ-val,QuantSig,PEP,MassErrorPPM
AATLGRDQYVYMAKLAEQAER,nt,A,2,true,"N-terminal ChaFRADIC",92,26010716,"MASCOT Score",41.6700000,,,,,3.7319999535157E-8,
AATLGRDQYVYMAKLAE,nt,A,2,true,"N-terminal ChaFRADIC",92,26010716,"MASCOT Score",23.8400000,,,,,0.00047790000098757,
AATLGRDQYVYMAKLAE,nt,A,2,true,"Arg/N-end rule seed, prt6 vs. Wt",99,29168982,"MASCOT Score",24.2700000,,,,,1.2700000695531E-7,1.6524711
AATLGRDQYVYM,nt,A,2,true,"Arg/N-end rule seed, prt6 vs. Wt",99,29168982,"MASCOT Score",51.2600000,,,,,0.00013650000619236,-1.4991892
AATLGRDQYVY,nt,A,2,true,"Arg/N-end rule seed, prt6 vs. Wt",99,29168982,"MASCOT Score",21.9600000,,,,,0.0095870001241565,-1.8456803
AATLGRDQYV,nt,A,2,true,"N-term acetylation drought responses",5,26184543,,,,,,,,
AATLGRDQYV,nt,A,2,true,"Arg/N-end rule seed, prt6 vs. Wt",99,29168982,"MASCOT Score",31.1300000,,,,,0.020780000835657,-0.2061441
AATLGRDQYVYMAKLAEQAER,nta,A,2,true,"N-terminal ChaFRADIC",92,26010716,"MASCOT Score",41.6700000,,,,,3.7319999535157E-8,
AATLGRDQYVYMAKLAE,nta,A,2,true,"N-terminal ChaFRADIC",92,26010716,"MASCOT Score",23.8400000,,,,,0.00047790000098757,
AATLGRDQYVYMAKLAE,nta,A,2,true,"Arg/N-end rule seed, prt6 vs. Wt",99,29168982,"MASCOT Score",24.2700000,,-0.2339243,0.3499089,NO,1.2700000695531E-7,1.6524711
AATLGRDQYVYMAKLAE,nta,A,2,true,"HUNTER N-terminome: legumain, GluC and trypsin",119,31951383,"MaxQuant score",58.5770000,,,,,,
AATLGRDQYVYMAKLAE,nta,A,2,true,"Arabidopsis translation initiation landscape - NTA",167a,35069635,,,,,,,,
AATLGRDQYVYM,nta,A,2,true,"Arg/N-end rule seed, prt6 vs. Wt",99,29168982,"MASCOT Score",51.2600000,,,,,0.00013650000619236,-1.4991892
AATLGRDQYVY,nta,A,2,true,"Arg/N-end rule seed, prt6 vs. Wt",99,29168982,"MASCOT Score",21.9600000,,,,,0.0095870001241565,-1.8456803
AATLGRDQYV,nta,A,2,true,"N-term acetylation drought responses",5,26184543,,,,,,,,
AATLGRDQYV,nta,A,2,true,"Arg/N-end rule seed, prt6 vs. Wt",99,29168982,"MASCOT Score",31.1300000,,,,,0.020780000835657,-0.2061441
NLLSVAYK,ph,S,52,false,"atm and atr DNA damage response",88,25561503,"MASCOT Score",39.0000000,1.0000000,,,,,-1.2400000
IVSSIEQKEESR,ac,K,75,false,"Histone deacetylases - apicidin vs control",98a,29061669,"MaxQuant Score",105.7000000,1.0000000,0.2050000,0.2338837,NO,0.00023999999393709,
IVSSIEQKEESR,ac,K,75,false,"Histone deacetylases- hda14 vs WT (low light)",98c,29061669,"MaxQuant Score",128.5400000,1.0000000,-0.1980000,0.9885531,NO,1.200000042445E-5,
IVSSIEQKEESR,ac,K,75,false,"Quantitative Acetylproteomics",101,29440448,,,,,,,,
IVSSIEQKEESR,ub,K,75,false,"Arabidopsis ubiquitination COFRADIC",40,26744219,"MaxQuant Score",116.2400000,1.0000000,,,,4.0889999719518E-12,0.0840000
IVSSIEQKEESR,ub,K,75,false,"upl3 mutant / wildtype",168,35926874,"MaxQuant score",181.6600000,1.0000000,-0.2915920,0.6788000,NO,1.4039000539347E-13,-0.4877100
KNDEHVSLVK,ub,K,80,true,"upl3 mutant / wildtype",168,35926874,"MaxQuant score",106.6700000,1.0000000,0.2582174,0.8582000,NO,0.0024350800085813,-0.6528300
VESELSSVCSGILK,acy,C,103,true,"Arabidopsis S-acylation atlas - Hypocotyl",163b,35681017,,,,,,,,
SKVESELSSVCSGILK,sno,C,103,true,"Site-specific nitrosomeproteomic id - gsnor1-3",90a,25699590,XCorr,3.8623576,,,,,4.0130000655836E-8,-5.2082197
SKVESELSSVCSGILK,sno,C,103,true,"Site-specific nitrosomeproteomic id - gsnor1-3",90b,25699590,XCorr,2.9100000,,,,,2.3330001113209E-6,-7.5800000
VESELSSVCSGILK,sno,C,103,true,"Site-specific nitrosomeproteomic id - gsnor1-3",90b,25699590,XCorr,2.6700000,,,,,0.013220000080764,-7.2500000
VESELSSVCSGILK,sno,C,103,true,"hot5-4 / wildtype, FAT-switch S-nitrosoproteome",169,37277371,,,,-0.1872329,0.1418013,NO,,
VESELSSVCSGILK,so,C,103,true,"Arabidopsis S-sulfenylation chemoproteomics",108,31578252,"pFind PSM Score",0.0134558,,1.3447600,,,,-1.7020948
VESELSSVCSGILK,so,C,103,true,"S-sulfenylation site detection using YAP1C",110,32714340,,,,,,,,
SKVFYLKMKGDYHRYMAE,nt,S,123,true,"Arabidopsis translation initiation landscape - NT",167b,35069635,,,,,,,,
VFYLKMK,ac,K,129,false,"Quantitative Acetylproteomics",101,29440448,,,,,,,,
MKGDYHRYMAE,nt,M,130,true,"Arabidopsis translation initiation landscape - NT",167b,35069635,,,,,,,,
DYHRYMAEFKSG,nt,D,133,true,"Arabidopsis translation initiation landscape - NT",167b,35069635,,,,,,,,
YMAEFKSGDERK,ac,K,142,true,"Quantitative Acetylproteomics",101,29440448,,,,,,,,
YMAEFKSGDER,ac,K,142,true,"Quantitative Acetylproteomics",101,29440448,,,,,,,,
KTAAEDTMLAYK,ub,K,148,true,"upl3 mutant / wildtype",168,35926874,"MaxQuant score",99.8440000,1.0000000,0.2400090,0.7515600,NO,0.0008851449820213,-0.9436200
ACNMAK,sno,C,198,true,"hot5-4 / wildtype, FAT-switch S-nitrosoproteome",169,37277371,,,,,,,,
ACNMAK,so,C,198,true,"Arabidopsis S-sulfenylation chemoproteomics",108,31578252,"pFind PSM Score",0.2686820,,0.9254700,,,,0.9787650
