Peptide,PTM,ModifiedAA,ModifiedPosition,PeptideUniqueToGene,ExperimentDesc,ExpID,PubmedID,ScoreType,IdentScore,LocProb,Log2FChange,PQ-val,QuantSig,PEP,MassErrorPPM
STTTTSGSNFVSGSSHSPSR,nt,S,41,true,"Arg/N-end rule seed, prt6 vs. Wt",99,29168982,"MASCOT Score",67.9800000,,-1.2058735,0.0959688,NO,0.0024089999496937,-2.6647009
STTTTSGSNFVSGSSHSPSR,nta,S,41,true,"FtsH12 N-terminome: WT / FtsH12 knockdown miRNA",118,33216923,"MaxQuant score",184.2400000,,,,,5.3299999019411E-18,
GECVTGK,sno,C,221,true,"hot5-4 / wildtype, FAT-switch S-nitrosoproteome",169,37277371,,,,0.7961941,0.0008533,YES,,
NVQEEGPSCLR,ox,C,643,true,"OxiTRAQ Arabidopsis - 5 mM H2O2 versus control",47,24376095,,,,2.3224703,0.0024940,YES,,
KLPVYEPSLSEDEEDSGSERDNPEK,ph,S,847,true,"Large-scale phosphorylation discovery",44,23111157,XCorr,4.8190000,,,,,,
KLPVYEPSLSEDEEDSGSERDNPEK,ph,S,847,true,"Brassinosteroid-Regulated Phosphorylation Dynamics",94,26187819,"MaxQuant Score",114.6000000,0.8850000,,,,1.8000000068241E-7,-5.5070000
KLPVYEPSLSEDEEDSGSERDNPEK,ph,S,847,true,"TOR Kinase and ABA Receptor",100,29290610,XCorr,4.6080141,0.8629000,,,,1.7840000055003E-6,
KLPVYEPSLSEDEEDSGSERDNPEK,ph,S,847,true,"Tissue atlas Arabidopsis - ProteomicsDB",114,32188942,"MaxQuant score",189.9800000,0.8156170,,,,0,
LPVYEPSLSEDEEDSGSERDNPEK,ph,S,847,true,"TOR Kinase and ABA Receptor",100,29290610,XCorr,4.3739109,0.8588000,,,,4.9490001401864E-5,
KLPVYEPSLSEDEEDSGSERDNPEKK,ph,S,849,true,"Arabidopsis root NAA phosphoproteome",18a,27643528,"MaxQuant Score",40.0640000,0.8280000,,,,0.00085720000788569,0.2020000
KLPVYEPSLSEDEEDSGSERDNPEK,ph,S,849,true,"Brassinosteroid-Regulated Phosphorylation Dynamics",94,26187819,"MaxQuant Score",107.7800000,0.9860000,,,,2.1350000679377E-5,-0.0960000
KLPVYEPSLSEDEEDSGSER,ph,S,849,true,"LAXIC - ABA stress",84a,23660473,XCorr,3.7500000,0.9710000,,,,0.0050054602324963,
KLPVYEPSLSEDEEDSGSER,ph,S,849,true,"SnRK2 protein kinase substrates",85,23776212,XCorr,2.3467302,0.9420000,,,,3.5298500733916E-5,
KLPVYEPSLSEDEEDSGSER,ph,S,849,true,"TOR Kinase and ABA Receptor",100,29290610,XCorr,3.5658514,0.8746000,,,,0.00029739999445155,
KLPVYEPSLSEDEEDSGSER,ph,S,849,true,"Phospho cell culture sucrose/TOR",109,30833711,,,0.9997120,,,,,
KLPVYEPSLSEDEEDSGSER,ph,S,849,true,"Col-0 callus - FC Col-0 vs. Col-0 Xray",111a,31410901,,65.7300000,,0.3925340,0.0000000,NO,,1.3321292
KLPVYEPSLSEDEEDSGSER,ph,S,849,true,"Col-0 X-ray callus - FC Col-0 vs. Col-0 Xray",111b,31410901,,65.7300000,,0.3925340,0.0000000,NO,,1.3321292
KLPVYEPSLSEDEEDSGSER,ph,S,849,true,"atm callus - FC atm vs. atm Xray",111c,31410901,,65.7300000,,1.2354642,0.0000000,NO,,1.3321292
KLPVYEPSLSEDEEDSGSER,ph,S,849,true,"atm-3 X-ray callus - FC atm vs. atm Xray",111d,31410901,,65.7300000,,1.2354642,0.0000000,NO,,1.3321292
LPVYEPSLSEDEEDSGSER,ph,S,849,true,"Tissue atlas Arabidopsis - ProteomicsDB",114,32188942,"MaxQuant score",323.4700000,0.9999980,,,,0,
KLPVYEPSLSEDEEDSGSERDNPEK,ph,S,855,true,"Large-scale phosphorylation discovery",44,23111157,XCorr,4.8190000,,,,,,
KLPVYEPSLSEDEEDSGSERDNPEK,ph,S,855,true,"SnRK2 protein kinase substrates",85,23776212,XCorr,4.1411185,0.8950000,,,,0.0003121710033156,
KLPVYEPSLSEDEEDSGSERDNPEK,ph,S,855,true,"Brassinosteroid-Regulated Phosphorylation Dynamics",94,26187819,"MaxQuant Score",114.6000000,0.9970000,,,,1.8000000068241E-7,-2.7680000
KLPVYEPSLSEDEEDSGSERDNPEK,ph,S,855,true,"TOR Kinase and ABA Receptor",100,29290610,XCorr,5.5909114,0.9732000,,,,0.00078740000026301,
KLPVYEPSLSEDEEDSGSERDNPEK,ph,S,855,true,"Phospho cell culture sucrose/TOR",109,30833711,,,0.8426200,,,,,
KLPVYEPSLSEDEEDSGSER,ph,S,855,true,"Tissue atlas Arabidopsis - ProteomicsDB",114,32188942,"MaxQuant score",266.6300000,0.9802630,,,,0,
KLPVYEPSLSEDEEDSGSERDNPEK,ph,S,857,true,"Brassinosteroid-Regulated Phosphorylation Dynamics",94,26187819,"MaxQuant Score",114.6000000,0.9970000,,,,1.8000000068241E-7,-2.7680000
TYSFVKDSEV,ph,S,917,true,"STN8 phosphoproteome",38,21768351,"MASCOT Score",54.1600000,,,,,,-1.3885600
TYSFVKDSEV,ph,S,917,true,"Phospho cell culture sucrose/TOR",109,30833711,,,0.9982370,,,,,
TYSFVKDSEV,ph,S,917,true,"Tissue atlas Arabidopsis - ProteomicsDB",114,32188942,"MaxQuant score",102.6200000,0.9998690,,,,0.00066716701257974,
TYSFVK,ph,S,917,false,"Conserved plant phosphoproteome - Arabidopsis",61a,20466843,"MASCOT Score",22.0000000,1.0000000,,,,,
