Peptide,PTM,ModifiedAA,ModifiedPosition,PeptideUniqueToGene,ExperimentDesc,ExpID,PubmedID,ScoreType,IdentScore,LocProb,Log2FChange,PQ-val,QuantSig,PEP,MassErrorPPM
ADGEDIQPLVCDNGTGMVKAGFAGDDAPR,nt,A,2,false,"Arg/N-end rule seed, prt6 vs. Wt",99,29168982,"MASCOT Score",67.8700000,,,,,1.7489999663667E-5,-1.2700550
ADGEDIQPLVCDNGTGMVKAGF,nt,A,2,false,"Arg/N-end rule seed, prt6 vs. Wt",99,29168982,"MASCOT Score",49.4400000,,,,,0.0012270000297576,-3.9214466
ADGEDIQPLVCDNGTGMVKA,nt,A,2,false,"Arg/N-end rule seed, prt6 vs. Wt",99,29168982,"MASCOT Score",25.2300000,,,,,0.018789999186993,-7.6013616
ADGEDIQPLVCDNGTGM,nt,A,2,false,"Arg/N-end rule seed, prt6 vs. Wt",99,29168982,"MASCOT Score",31.7400000,,,,,0.049639999866486,-3.5680717
ADGEDIQPLVCD,nt,A,2,false,"Arg/N-end rule seed, prt6 vs. Wt",99,29168982,"MASCOT Score",27.8800000,,,,,0.020859999582171,-2.5578914
ADGEDIQPLV,nt,A,2,false,"N-term acetylation drought responses",5,26184543,,,,,,,,
ADGEDIQPLVCDNGTGMVKAGFAGDDAPR,nta,A,2,false,"Arg/N-end rule seed, prt6 vs. Wt",99,29168982,"MASCOT Score",67.8700000,,0.8739761,0.1575568,NO,1.7489999663667E-5,-1.2700550
ADGEDIQPLVCDNGTGMVKAGFAGDDAPR,nta,A,2,false,"HUNTER N-terminome: legumain, GluC and trypsin",119,31951383,"MaxQuant score",121.9600000,,,,,,
ADGEDIQPLVCDNGTGMVKAGFAGDDAPR,nta,A,2,false,"Arabidopsis translation initiation landscape - NTA",167a,35069635,,,,,,,,
ADGEDIQPLVCDNGTGMVKAGF,nta,A,2,false,"Arg/N-end rule seed, prt6 vs. Wt",99,29168982,"MASCOT Score",49.4400000,,-0.6354695,0.3061860,NO,0.0012270000297576,-3.9214466
ADGEDIQPLVCDNGTGMVKA,nta,A,2,false,"Arg/N-end rule seed, prt6 vs. Wt",99,29168982,"MASCOT Score",25.2300000,,0.0199622,0.8903952,NO,0.018789999186993,-7.6013616
ADGEDIQPLVCDNGTGMVK,nta,A,2,false,"Characterization plant N-terminal acetylation",6,22223895,"MASCOT Score",78.1500000,,,,,,
ADGEDIQPLVCDNGTGM,nta,A,2,false,"Arg/N-end rule seed, prt6 vs. Wt",99,29168982,"MASCOT Score",31.7400000,,,,,0.049639999866486,-3.5680717
ADGEDIQPLVCD,nta,A,2,false,"Arg/N-end rule seed, prt6 vs. Wt",99,29168982,"MASCOT Score",27.8800000,,,,,0.020859999582171,-2.5578914
ADGEDIQPLV,nta,A,2,false,"N-term acetylation drought responses",5,26184543,,,,,,,,
ADGEDIQPLVCDNGTGMVK,so,C,12,false,"S-sulfenylation site detection using YAP1C",110,32714340,,,,,,,,
AGFAGDDAPR,nt,A,21,false,"Arg/N-end rule seed, prt6 vs. Wt",99,29168982,"MASCOT Score",49.2300000,,,,,0.0097279995679855,-0.6321017
AVFPSIVGRPR,nt,A,31,false,"Arabidopsis translation initiation landscape - NT",167b,35069635,,,,,,,,
HTGVMVGMGQKDAYVGDEAQSKR,nt,H,42,false,"HUNTER N-terminome: legumain, GluC and trypsin",119,31951383,"MaxQuant score",46.1780000,,,,,,
PRHTGVMVGMGQK,ph,T,43,false,"Tissue atlas Arabidopsis - ProteomicsDB",114,32188942,"MaxQuant score",218.0600000,1.0000000,,,,6.046749993596E-32,
GMGQKDAYVGDEAQSKR,nt,G,48,false,"Arg/N-end rule pathway Roots",80,25728785,"MASCOT Score",38.3800000,,,,,0.00014089999604039,
MGQKDAYVGDEAQSKR,nt,M,49,false,"Arabidopsis translation initiation landscape - NT",167b,35069635,,,,,,,,
KDAYVGDEAQSKR,nt,K,52,false,"Metacaspase9 substrates - Col-0 / mc9",51a,23964026,"MASCOT Score",97.0000000,,1.0929999,,NO,,-1.4218983
HTGVMVGMGQKDAYVGDEAQSK,ub,K,52,false,"upl3 mutant / wildtype",168,35926874,"MaxQuant score",94.7070000,1.0000000,0.5926364,0.6341400,NO,3.0817201235322E-8,-0.2296800
DAYVGDEAQSKR,nt,D,53,false,"Metacaspase9 substrates - Col-0 / mc9",51a,23964026,"MASCOT Score",58.0000000,,1.4443579,,NO,,-1.1442161
DAYVGDEAQSKR,nt,D,53,false,"Metacaspase9 substrates - 35S:MC9 / mc9",51b,23964026,"MASCOT Score",80.0000000,,2.0040840,,NO,,-1.0150866
DAYVGDEAQSKR,nt,D,53,false,"Metacaspase9 substrates - in vitro rMC9",51c,23964026,"MASCOT Score",74.0000000,,2.5033535,,NO,,-0.2692275
AQSKRGILTLKYPIE,nt,A,60,false,"Arabidopsis translation initiation landscape - NT",167b,35069635,,,,,,,,
DAYVGDEAQSKR,ph,S,62,false,"atm and atr DNA damage response",88,25561503,"MASCOT Score",45.0000000,1.0000000,,,,,-2.4800000
DAYVGDEAQSKR,ph,S,62,false,"Tissue atlas Arabidopsis - ProteomicsDB",114,32188942,"MaxQuant score",118.1600000,1.0000000,,,,6.4769803429954E-5,
DAYVGDEAQSKR,ac,K,63,false,"Quantitative Acetylproteomics",101,29440448,,,,,,,,
DAYVGDEAQSKR,ub,K,63,false,"upl3 mutant / wildtype",168,35926874,"MaxQuant score",142.1000000,1.0000000,-0.1392358,0.9123400,NO,1.2929699977349E-8,0.6924400
VAPEEHPVLLTEAPLNPKANR,ub,K,115,false,"upl3 mutant / wildtype",168,35926874,"MaxQuant score",120.1100000,1.0000000,0.4059924,0.6063000,NO,2.6614399889529E-16,-0.4561900
TTGIVLDSGDGVSHTVPIYEGYALPHAILR,nt,T,150,false,"Arabidopsis translation initiation landscape - NT",167b,35069635,,,,,,,,
TTGIVLDSGDGVSH,nt,T,150,false,"Arg/N-end rule seed, prt6 vs. Wt",99,29168982,"MASCOT Score",76.9100000,,,,,0.0049939998425543,-3.6660702
SGDGVSHTVPIYE,nt,S,157,false,"Arg/N-end rule seed, prt6 vs. Wt",99,29168982,"MASCOT Score",51.8200000,,,,,5.9660000260919E-5,-3.2780340
DGVSHTVPIYEGYALPHAILRL,nt,D,159,false,"Arabidopsis translation initiation landscape - NT",167b,35069635,,,,,,,,
DLTDSLMKILTER,ub,K,193,true,"upl3 mutant / wildtype",168,35926874,"MaxQuant score",103.7600000,1.0000000,0.4688439,,,1.2541900105134E-5,-1.3923000
GYMFTTTAER,ph,T,205,false,"Tissue atlas Arabidopsis - ProteomicsDB",114,32188942,"MaxQuant score",74.9620000,0.8158470,,,,0.0035898699425161,
KLAYVALDYEQE,nt,K,217,true,"Arabidopsis translation initiation landscape - NT",167b,35069635,,,,,,,,
YVALDYE,nt,Y,220,false,"Arg/N-end rule seed, prt6 vs. Wt",99,29168982,"MASCOT Score",41.6000000,,-0.3006371,0.5295364,NO,0.045129999518394,0.9997133
LAYVALDYEQELETAKSSSSVEK,ub,K,233,true,"upl3 mutant / wildtype",168,35926874,"MaxQuant score",181.6000000,1.0000000,1.2503553,0.3101000,NO,1.3359800192669E-38,-0.4975100
SSSSVEKNYELPDGQVITIGAER,ub,K,240,true,"upl3 mutant / wildtype",168,35926874,"MaxQuant score",114.3900000,1.0000000,0.5897635,0.2504200,NO,1.0286500384121E-12,-0.0605360
NYELPDGQVITIGAER,nt,N,241,false,"Metacaspase9 substrates - Col-0 / mc9",51a,23964026,"MASCOT Score",54.0000000,,2.8753289,,NO,,-3.0303840
NYELPDGQVITIGAER,nt,N,241,false,"Metacaspase9 substrates - 35S:MC9 / mc9",51b,23964026,"MASCOT Score",57.0000000,,4.0989103,,NO,,-3.1386117
CPEVLFQPSLIGMEAPGIHETTYNSIMK,sno,C,259,true,"Site-specific nitrosomeproteomic id - gsnor1-3",90b,25699590,XCorr,3.7600000,,,,,5.9000001328968E-8,-6.3000000
FRCPEVLFQPSLIGMEAPGIHETTYNSIMK,so,C,259,true,"S-sulfenylation site detection using YAP1C",110,32714340,,,,,,,,
TTYNSIMKCDVDIRKD,nt,T,279,false,"Arabidopsis translation initiation landscape - NT",167b,35069635,,,,,,,,
TTYNSIMKCD,nt,T,279,false,"Arg/N-end rule seed, prt6 vs. Wt",99,29168982,"MASCOT Score",27.1400000,,,,,0.00035710001247935,-1.9915902
SIMKCDVDIRKD,nt,S,283,false,"Arabidopsis translation initiation landscape - NT",167b,35069635,,,,,,,,
CDVDIR,ox,C,287,false,"OxiTRAQ Arabidopsis - 5 mM H2O2 versus control",47,24376095,,,,-0.2564682,0.0913252,NO,,
CDVDIR,sno,C,287,false,"Cold stress nitrosylation - 4°C vs 22°C",65,24388526,,,,,,,,
CDVDIR,sno,C,287,false,"hot5-4 / wildtype, FAT-switch S-nitrosoproteome",169,37277371,,,,,,,,
CDVDIRK,so,C,287,false,"S-sulfenylation site detection using YAP1C",110,32714340,,,,,,,,
NIVLSGGSTMFPGIADR,nt,N,298,true,"Arg/N-end rule seed, prt6 vs. Wt",99,29168982,"MASCOT Score",33.1900000,,0.4660231,0.2334147,NO,0.10620000213385,-1.2986083
MSKEITALAPSSMK,ub,K,317,false,"upl3 mutant / wildtype",168,35926874,"MaxQuant score",83.5400000,1.0000000,-0.5145732,0.4364200,NO,0.00010967499838443,-1.7227000
EITALAPSSMK,ph,S,325,false,"atm and atr DNA damage response",88,25561503,"MASCOT Score",53.0000000,0.9620000,,,,,0.1200000
EITALAPSSMK,ph,S,325,false,"Phospho cell culture sucrose/TOR",109,30833711,,,0.7807390,,,,,
EITALAPSSMK,ph,S,325,false,"Tissue atlas Arabidopsis - ProteomicsDB",114,32188942,"MaxQuant score",130.7700000,0.8321070,,,,1.1225499747525E-6,
EITALAPSSMK,ph,S,326,false,"atm and atr DNA damage response",88,25561503,"MASCOT Score",38.0000000,0.9620000,,,,,-0.8100000
EITALAPSSMK,ph,S,326,false,"Tissue atlas Arabidopsis - ProteomicsDB",114,32188942,"MaxQuant score",180.2400000,0.8310520,,,,1.5202200053812E-14,
EITALAPSSMK,mox,M,327,false,"cat2 Methionine oxidation - 1h stress",62a,25693801,"MASCOT Score",94.0000000,,0.4525829,,NO,,
EITALAPSSMK,mox,M,327,false,"cat2 Methionine oxidation - 3h stress",62b,25693801,"MASCOT Score",47.0000000,,-0.1391666,,NO,,
EITALAPSSMKIK,ac,K,328,false,"Quantitative Acetylproteomics",101,29440448,,,,,,,,
EITALAPSSMKIK,cr,K,328,false,"Open search Plant PTM Viewer 2.0 - Crotonylation",164c,TBA,,,,,,,,
EITALAPSSMKIK,ub,K,328,false,"upl3 mutant / wildtype",168,35926874,"MaxQuant score",112.4400000,1.0000000,0.8551924,0.3769400,NO,1.2826700185542E-5,-2.1161000
IKVVAPPER,ub,K,330,false,"upl3 mutant / wildtype",168,35926874,"MaxQuant score",66.0560000,1.0000000,0.9825829,0.1499390,NO,0.010741700418293,-0.2544700
