Peptide,PTM,ModifiedAA,ModifiedPosition,PeptideUniqueToGene,ExperimentDesc,ExpID,PubmedID,ScoreType,IdentScore,LocProb,Log2FChange,PQ-val,QuantSig,PEP,MassErrorPPM
ADPDLLSGVIR,nt,A,276,false,"Arg/N-end rule seed, prt6 vs. Wt",99,29168982,"MASCOT Score",29.3600000,,-0.9674078,0.0060470,NO,0.11280000209808,-1.4704017
AGLVNETAIDK,ng,N,349,true,"Conserved N-glycosylation",74,22633491,"MaxQuant Score",87.0300000,1.0000000,,,,0.0010000000474975,-0.3360000
AGLVNETAIDK,ng,N,349,true,"N-glycan occupancy Arabidopsis glycoproteins",87,23994444,"Ladder score",55.6000000,,,,,,
AGLVNETAIDK,ng,N,349,true,"N-Glycopeptide Profiling in Arabidopsis Infloresce",132,27067053,"MOWSE score",19.4000000,,,,,0.012000000104308,
AGLVNETAIDK,ng,N,349,true,"UDP-GlcNAc transporter glycopeptide analysis",135,30224661,,,,,,,0.00014176558761392,0.9000000
TLAVIGPNANATETMIGNYHGVPCK,ng,N,432,true,"Conserved N-glycosylation",74,22633491,"MaxQuant Score",225.8300000,0.9970000,,,,0,-0.2400000
FNVNVCKDLSVVDETGKR,ub,K,740,true,"Protein ubiquitination during photomorphogenesis",3,28461270,,,,,,,,
FNVNVCKDLSVVDETGKR,ub,K,750,true,"Protein ubiquitination during photomorphogenesis",3,28461270,,,,,,,,
