Peptide,PTM,ModifiedAA,ModifiedPosition,PeptideUniqueToGene,ExperimentDesc,ExpID,PubmedID,ScoreType,IdentScore,LocProb,Log2FChange,PQ-val,QuantSig,PEP,MassErrorPPM
DVVNAPGVTADVSHMDTGAVVR,nt,D,75,true,"Arg/N-end rule seed, prt6 vs. Wt",99,29168982,"MASCOT Score",103.4000000,,-0.3837730,0.2482035,NO,1.043999986905E-6,-2.0887880
DVVNAPGVTADVSHMDTGAVVR,nt,D,75,true,"FtsH12 N-terminome: WT / FtsH12 knockdown miRNA",118,33216923,"MaxQuant score",106.0000000,,,,,1.8499999128922E-24,
DDLFKINAGIVK,ac,K,133,true,"Histone deacetylases - apicidin vs control",98a,29061669,"MaxQuant Score",100.0000000,1.0000000,-0.0400000,0.8109611,NO,2.2999999682582E-9,
DDLFKINAGIVK,ac,K,133,true,"Histone deacetylases substrates - TSA vs control",98b,29061669,"MaxQuant Score",100.0000000,1.0000000,0.1110000,0.9977001,NO,2.2999999682582E-9,
DDLFKINAGIVK,ac,K,133,true,"Histone deacetylases substrates - hda14 vs WT",98e,29061669,"MaxQuant Score",110.1000000,1.0000000,0.0320000,0.9705100,NO,9.999999960042E-13,
INAGIVKTLCEGVAK,ac,K,140,true,"Histone deacetylases - apicidin vs control",98a,29061669,"MaxQuant Score",174.9000000,1.0000000,0.2840000,0.1520548,NO,1.3998971658605E-42,
INAGIVKTLCEGVAK,ac,K,140,true,"Histone deacetylases substrates - hda14 vs WT",98e,29061669,"MaxQuant Score",52.5000000,1.0000000,0.1340000,0.9099133,NO,0.00089000002481043,
TLCEGVAK,ox,C,143,true,"OxiTRAQ Arabidopsis - 5 mM H2O2 versus control",47,24376095,,,,0.2353983,0.2561631,NO,,
TLCEGVAK,sno,C,143,true,"hot5-4 / wildtype, FAT-switch S-nitrosoproteome",169,37277371,,,,-1.0891218,0.0215296,YES,,
AGAGSATLSMAYAAAK,ph,S,264,true,"Tissue atlas Arabidopsis - ProteomicsDB",114,32188942,"MaxQuant score",97.7670000,0.9969550,,,,2.5571300739102E-6,
AGAGSATLSMAYAAAK,mox,M,269,true,"cat2 Methionine oxidation - 1h stress",62a,25693801,"MASCOT Score",50.0000000,,0.0624731,,NO,,
FADACLR,sno,C,280,false,"Cold stress nitrosylation - 4°C vs 22°C",65,24388526,,,,,,,,
IGLEKAK,ac,K,336,true,"Quantitative Acetylproteomics",101,29440448,,,,,,,,
AKDELAGSIQK,ph,S,344,true,"atm and atr DNA damage response",88,25561503,"MASCOT Score",50.0000000,1.0000000,,,,,-1.0800000
AKDELAGSIQK,ph,S,344,true,"Tissue atlas Arabidopsis - ProteomicsDB",114,32188942,"MaxQuant score",169.8000000,1.0000000,,,,2.7376800479373E-11,
