Peptide,PTM,ModifiedAA,ModifiedPosition,PeptideUniqueToGene,ExperimentDesc,ExpID,PubmedID,ScoreType,IdentScore,LocProb,Log2FChange,PQ-val,QuantSig,PEP,MassErrorPPM
FSSKPAGNDVIGIDLGTTNSCVAVMEGKNPKVIENAEGAR,nt,F,50,true,"Mitochondrial intermediate peptidases - icp55 / WT",131a,25732537,,62.9500000,,6.6438562,,,,
SSKPAGNDVIGIDLGTTNSCVAVMEGKNPKVIENAEGAR,nt,S,51,true,"Arg/N-end rule pathway Roots",80,25728785,"MASCOT Score",35.7100000,,,,,2.7570000384003E-5,
SSKPAGNDVIGIDLGTTNSCVAVMEGKNPKVIENAEGAR,nt,S,51,true,"HUNTER N-terminome: legumain, GluC and trypsin",119,31951383,"MaxQuant score",81.7320000,,,,,,
SSKPAGNDVIGIDLGTTNSCVAVMEGKNPKVIENAEGAR,nt,S,51,true,"Mitochondrial intermediate peptidases - icp55 / WT",131a,25732537,,89.8600000,,-1.5848179,,,,
SSKPAGNDVIGIDLGTTNSCVAVMEGKNPKVIENAEGAR,nt,S,51,true,"Mitochondrial intermediate peptidases - oct1-1 / WT",131b,25732537,,85.4400000,,-0.7502165,,,,
SSKPAGNDVIGIDLGTTNSCVAVMEGKNPKVIENAEGAR,nt,S,51,true,"Mitochondrial intermediate peptidases - oct1-2 / WT",131c,25732537,,85.1400000,,-1.1283148,,,,
SSKPAGNDVIGIDLGTTNSCVAVME,nt,S,51,true,"HUNTER N-terminome: legumain, GluC and trypsin",119,31951383,"MaxQuant score",58.8120000,,,,,,
PAGNDVIGIDLGTTNSCVAVMEGK,so,C,70,true,"S-sulfenylation site detection using YAP1C",110,32714340,,,,,,,,
GELLVGTPAKR,ph,T,107,false,"Tissue atlas Arabidopsis - ProteomicsDB",114,32188942,"MaxQuant score",88.0870000,1.0000000,,,,0.0012649099808186,
GELLVGTPAKR,ac,K,110,false,"Quantitative Acetylproteomics",101,29440448,,,,,,,,
QAVTNPTNTVSGTKR,nt,Q,112,true,"HUNTER N-terminome: legumain, GluC and trypsin",119,31951383,"MaxQuant score",,,,,,,
QAVTNPTNTVSGTK,ph,S,122,true,"Lateral root-induction - NAA vs control",106,23328941,"MASCOT Score",41.0000000,,,,,,
QAVTNPTNTVSGTKR,ac,K,125,true,"Quantitative Acetylproteomics",101,29440448,,,,,,,,
QAVTNPTNTVSGTKR,ub,K,125,true,"Arabidopsis ubiquitination COFRADIC",40,26744219,"MaxQuant Score",141.0000000,1.0000000,,,,1.8499999252182E-26,0.7420000
MKETAEAYLGK,cr,K,179,false,"Open search Plant PTM Viewer 2.0 - Crotonylation",164c,TBA,,,,,,,,
LREAAEKAK,ac,K,317,false,"Quantitative Acetylproteomics",101,29440448,,,,,,,,
TRDPCK,so,C,369,true,"S-sulfenylation site detection using YAP1C",110,32714340,,,,,,,,
EVDEVLLVGGMTRVPK,mox,M,392,false,"cat2 Methionine oxidation - 3h stress",62b,25693801,"MASCOT Score",40.0000000,,-0.5956356,,NO,,
VQSIVAEIFGKSPSK,ph,S,409,true,"Conserved plant phosphoproteome - Arabidopsis",61a,20466843,"MASCOT Score",32.0000000,1.0000000,,,,,
VQSIVAEIFGKSPSK,ph,S,409,true,"Phospho cell culture sucrose/TOR",109,30833711,,,0.9759230,,,,,
VQSIVAEIFGKSPSK,ph,S,409,true,"Touch-induced phosphorylation: 40s touch vs untouc",136,30291188,"MASCOT score",67.9700000,,-0.0113384,0.9769234,NO,,2.5238714
NTTIPTKK,ac,K,470,false,"Quantitative Acetylproteomics",101,29440448,,,,,,,,
SSGGLSEDDIQKMVR,nt,S,552,true,"Metacaspase9 substrates - in vitro rMC9",51c,23964026,"MASCOT Score",80.0000000,,1.6603869,,NO,,-0.6190705
SSGGLSEDDIQKMVR,nt,S,552,true,"Arabidopsis translation initiation landscape - NT",167b,35069635,,,,,,,,
SGGLSEDDIQKMVR,nt,S,553,true,"Metacaspase9 substrates - in vitro rMC9",51c,23964026,"MASCOT Score",59.0000000,,2.4169955,,NO,,-0.8284878
SSGGLSEDDIQKMVR,ub,K,563,true,"Arabidopsis ubiquitination COFRADIC",40,26744219,"MaxQuant Score",110.5500000,1.0000000,,,,3.6219999680343E-16,0.1660000
EAELHAQKDKER,ub,K,574,true,"Arabidopsis ubiquitination COFRADIC",40,26744219,"MaxQuant Score",82.0690000,1.0000000,,,,0.00017430000298191,0.3550000
EAELHAQKDKER,ub,K,576,true,"Arabidopsis ubiquitination COFRADIC",40,26744219,"MaxQuant Score",82.0690000,1.0000000,,,,0.00017430000298191,0.3550000
SASSGDDLNEIKAK,ac,K,634,false,"Quantitative Acetylproteomics",101,29440448,,,,,,,,
EHMSGGSGGGSAPGGGSEGGS,nt,E,649,false,"Arabidopsis translation initiation landscape - NT",167b,35069635,,,,,,,,
