Peptide,PTM,ModifiedAA,ModifiedPosition,PeptideUniqueToGene,ExperimentDesc,ExpID,PubmedID,ScoreType,IdentScore,LocProb,Log2FChange,PQ-val,QuantSig,PEP,MassErrorPPM
ADVEPEVAAAGVPKKR,nt,A,2,false,"Stromal N-terminome",96,26371235,"MASCOT Score",79.9100000,,,,,,
ADVEPEVAAAGVPKKR,nt,A,2,false,"Arg/N-end rule seed, prt6 vs. Wt",99,29168982,"MASCOT Score",42.3800000,,,,,0.00046059998567216,-1.5023131
ADVEPEVAAAGVPK,nt,A,2,false,"Arg/N-end rule seed, prt6 vs. Wt",99,29168982,"MASCOT Score",37.3100000,,,,,0.018580000847578,-1.1339313
ADVEPEVAAA,nt,A,2,false,"N-term acetylation drought responses",5,26184543,,,,,,,,
ADVEPEVAAAGVPKKRTFKKFAFKGVDL,nta,A,2,false,"Arabidopsis translation initiation landscape - NTA",167a,35069635,,,,,,,,
ADVEPEVAAAGVPKKR,nta,A,2,false,"Arg/N-end rule pathway Roots",80,25728785,"MASCOT Score",81.6000000,,,,,8.1359999626329E-8,
ADVEPEVAAAGVPKKR,nta,A,2,false,"Stromal N-terminome",96,26371235,"MASCOT Score",79.9100000,,,,,,
ADVEPEVAAAGVPKKR,nta,A,2,false,"Arg/N-end rule seed, prt6 vs. Wt",99,29168982,"MASCOT Score",42.3800000,,0.2677956,0.0556256,NO,0.00046059998567216,-1.5023131
ADVEPEVAAAGVPKKR,nta,A,2,false,"HUNTER N-terminome: legumain, GluC and trypsin",119,31951383,"MaxQuant score",126.6300000,,,,,,
ADVEPEVAAAGVPK,nta,A,2,false,"Characterization plant N-terminal acetylation",6,22223895,"MASCOT Score",89.5900000,,,,,,
ADVEPEVAAAGVPK,nta,A,2,false,"Arg/N-end rule pathway Roots",80,25728785,"MASCOT Score",70.1500000,,,,,0.00096079998183995,
ADVEPEVAAAGVPK,nta,A,2,false,"Arg/N-end rule seed, prt6 vs. Wt",99,29168982,"MASCOT Score",37.3100000,,-0.0170865,0.9709900,NO,0.018580000847578,-1.1339313
VAAAGVPKKR,nt,V,8,false,"Arabidopsis translation initiation landscape - NT",167b,35069635,,,,,,,,
ADVEPEVAAAGVPKKR,ub,K,15,false,"Arabidopsis ubiquitination COFRADIC",40,26744219,"MaxQuant Score",137.2100000,1.0000000,,,,2.1399999851194E-26,0.4830000
ADVEPEVAAAGVPKKR,ub,K,16,false,"Arabidopsis ubiquitination COFRADIC",40,26744219,"MaxQuant Score",137.2100000,1.0000000,,,,2.1399999851194E-26,0.4830000
LDMSTDDLVKLFSSR,nt,L,33,false,"Metacaspase9 substrates - Col-0 / mc9",51a,23964026,"MASCOT Score",57.0000000,,1.6995272,,NO,,-2.6984537
GVDLDALLDMSTDDLVK,ph,S,36,false,"SnRK2 protein kinase substrates",85,23776212,XCorr,4.0361166,0.9750000,,,,0.0016046699602157,
GVDLDALLDMSTDDLVK,ph,S,36,false,"Tissue atlas Arabidopsis - ProteomicsDB",114,32188942,"MaxQuant score",199.0500000,0.7899150,,,,1.1674301584198E-39,
KPMALIKK,ac,K,65,false,"Quantitative Acetylproteomics",101,29440448,,,,,,,,
EAPAGEKPEPVR,ub,K,79,true,"Arabidopsis ubiquitination COFRADIC",40,26744219,"MaxQuant Score",110.3100000,1.0000000,,,,2.9329999540195E-10,-0.5650000
PGVGATHSSR,nt,P,138,false,"Arabidopsis translation initiation landscape - NT",167b,35069635,,,,,,,,
PGVGATHSSR,nta,P,138,false,"Arabidopsis translation initiation landscape - NTA",167a,35069635,,,,,,,,
