Peptide,PTM,ModifiedAA,ModifiedPosition,PeptideUniqueToGene,ExperimentDesc,ExpID,PubmedID,ScoreType,IdentScore,LocProb,Log2FChange,PQ-val,QuantSig,PEP,MassErrorPPM
SFLEDEDSDKQPPEKR,ph,S,20,true,"SnRK2 protein kinase substrates",85,23776212,XCorr,2.5651000,0.9820000,,,,0.0030575399287045,
SFLEDEDSDKQPPEKR,ph,S,20,true,"Phospho cell culture sucrose/TOR",109,30833711,,,1.0000000,,,,,
SFLEDEDSDKQPPEKR,ph,S,20,true,"Tissue atlas Arabidopsis - ProteomicsDB",114,32188942,"MaxQuant score",320.5000000,1.0000000,,,,0,
RSFLEDEDSDKQPPEK,ph,S,20,true,"TOR Kinase and ABA Receptor",100,29290610,XCorr,4.0462689,0.9999000,,,,0.00024510000366718,
SFLEDEDSDKQPPEK,ph,S,20,true,"atm and atr DNA damage response",88,25561503,"MASCOT Score",44.0000000,1.0000000,,,,,-0.9700000
SFLEDEDSDKQPPEKR,ub,K,22,true,"Arabidopsis ubiquitination COFRADIC",40,26744219,"MaxQuant Score",123.0200000,1.0000000,,,,1.1990000128299E-27,-1.0420000
SFLEDEDSDKQPPEKR,ac,K,27,true,"Quantitative Acetylproteomics",101,29440448,,,,,,,,
SFLEDEDSDKQPPEKR,ub,K,27,true,"Arabidopsis ubiquitination COFRADIC",40,26744219,"MaxQuant Score",78.6900000,1.0000000,,,,1.3240000207304E-8,0.7670000
EKEEGYFDADGNFVEYVR,ub,K,109,true,"Arabidopsis ubiquitination COFRADIC",40,26744219,"MaxQuant Score",114.9900000,1.0000000,,,,4.6259998884162E-35,0.1620000
DAWLDSIEK,ph,S,136,true,"Tyrosine phosphorylation in Arabidopsis",59,18463617,"MASCOT Score",23.0000000,,,,,,-1.3847020
SAANDTEMDDDSGNEKAGDDLSQDEIGVR,ph,S,158,true,"Phosphoproteomic analysis of seed maturation",42,22440515,"MASCOT Score",84.0000000,,,,,,-0.8900000
SAANDTEMDDDSGNEKAGDDLSQDEIGVR,ph,S,158,true,"PAMP-triggered phosphorylation",48,24601666,"MASCOT Score",75.3200000,,,,,,
SAANDTEMDDDSGNEKAGDDLSQDEIGVR,ph,S,158,true,"Chloroplast kinase substrates",60,19376835,"MASCOT Score",110.5800000,,,,,,-1.0309800
SAANDTEMDDDSGNEKAGDDLSQDEIGVR,ph,S,158,true,"LAXIC - ABA stress",84a,23660473,XCorr,6.8500000,0.9950000,,,,0.00019802199676633,
SAANDTEMDDDSGNEKAGDDLSQDEIGVR,ph,S,158,true,"SnRK2 protein kinase substrates",85,23776212,XCorr,6.4685254,1.0000000,,,,2.8894801048368E-13,
SAANDTEMDDDSGNEKAGDDLSQDEIGVR,ph,S,158,true,"Col-0 callus - FC Col-0 vs. Col-0 Xray",111a,31410901,,46.7200000,,0.5913298,0.0000000,NO,,1.2926864
SAANDTEMDDDSGNEKAGDDLSQDEIGVR,ph,S,158,true,"Col-0 X-ray callus - FC Col-0 vs. Col-0 Xray",111b,31410901,,46.7200000,,0.5913298,0.0000000,NO,,1.2926864
SAANDTEMDDDSGNEKAGDDLSQDEIGVR,ph,S,158,true,"atm callus - FC atm vs. atm Xray",111c,31410901,,46.7200000,,1.7024415,0.0000000,NO,,1.2926864
SAANDTEMDDDSGNEKAGDDLSQDEIGVR,ph,S,158,true,"atm-3 X-ray callus - FC atm vs. atm Xray",111d,31410901,,46.7200000,,1.7024415,0.0000000,NO,,1.2926864
SAANDTEMDDDSGNEK,ph,S,158,true,"Tyrosine phosphorylation in Arabidopsis",59,18463617,"MASCOT Score",69.0000000,,,,,,-0.5063013
SAANDTEMDDDSGNEK,ph,S,158,true,"Chloroplast kinase substrates",60,19376835,"MASCOT Score",43.4700000,,,,,,-0.7554350
SAANDTEMDDDSGNEK,ph,S,158,true,"LAXIC - ABA stress",84a,23660473,XCorr,4.6500000,1.0000000,,,,2.1099999525376E-9,
SAANDTEMDDDSGNEK,ph,S,158,true,"SnRK2 protein kinase substrates",85,23776212,XCorr,4.7193794,1.0000000,,,,0.00023812800645828,
SAANDTEMDDDSGNEK,ph,S,158,true,"atm and atr DNA damage response",88,25561503,"MASCOT Score",99.0000000,1.0000000,,,,,-0.4800000
SAANDTEMDDDSGNEK,ph,S,158,true,"TOR Kinase and ABA Receptor",100,29290610,XCorr,6.3004942,1.0000000,,,,4.9299999638208E-9,
SAANDTEMDDDSGNEK,ph,S,158,true,"Lateral root-induction - NAA vs control",106,23328941,"MASCOT Score",76.0000000,,,,,,
AGDDLSQDEIGVRK,ph,S,168,true,"Tissue atlas Arabidopsis - ProteomicsDB",114,32188942,"MaxQuant score",274.6800000,1.0000000,,,,0,
AGDDLSQDEIGVR,ph,S,168,true,"Tyrosine phosphorylation in Arabidopsis",59,18463617,"MASCOT Score",56.0000000,,,,,,-0.3439717
AGDDLSQDEIGVR,ph,S,168,true,"Phospho cell culture sucrose/TOR",109,30833711,,,1.0000000,,,,,
YDEETKEYKEVVSEVATEEV,ub,K,337,true,"Arabidopsis ubiquitination COFRADIC",40,26744219,"MaxQuant Score",44.0540000,0.8970000,,,,9.6029998530867E-7,0.9560000
