Peptide,PTM,ModifiedAA,ModifiedPosition,PeptideUniqueToGene,ExperimentDesc,ExpID,PubmedID,ScoreType,IdentScore,LocProb,Log2FChange,PQ-val,QuantSig,PEP,MassErrorPPM
SLGINFGSEYSGSSVADDGR,ph,S,15,true,"Tissue atlas Arabidopsis - ProteomicsDB",114,32188942,"MaxQuant score",161.2000000,0.9981120,,,,5.6382899124649E-29,
EQNQLKDVFSFRER,ph,S,66,true,"Tissue atlas Arabidopsis - ProteomicsDB",114,32188942,"MaxQuant score",175.4300000,1.0000000,,,,5.7876698259538E-15,
DVFSFRER,ph,S,66,true,"srk2dei ABA signaling phopshoproteomics",83,23572148,"MASCOT Score",21.0000000,,,,,,-0.0008000
DVFSFRER,ph,S,66,true,"atm and atr DNA damage response",88,25561503,"MASCOT Score",26.0000000,1.0000000,,,,,-0.4200000
DVFSFR,ph,S,66,true,"Plasmembrane Ph Immune Responses",25,17651370,,,,,,,,
EAEDNFYDGIPTYTMAPSQK,ph,S,88,true,"Tissue atlas Arabidopsis - ProteomicsDB",114,32188942,"MaxQuant score",218.3800000,0.9990870,,,,0,
AKDVLDTLGSSMTDLSSGGFTSGVATK,ph,S,129,true,"Tissue atlas Arabidopsis - ProteomicsDB",114,32188942,"MaxQuant score",134.4200000,0.7637190,,,,8.5619336170246E-43,
GGPRLSSIK,ph,S,526,true,"Tissue atlas Arabidopsis - ProteomicsDB",114,32188942,"MaxQuant score",92.6110000,0.9468690,,,,0.0036766000557691,
TPCVSKSQDFDSEYSR,ph,S,570,true,"Tissue atlas Arabidopsis - ProteomicsDB",114,32188942,"MaxQuant score",78.7080000,0.8864270,,,,8.9817302068695E-5,
TPCVSKSQDFDSEYSR,ph,S,572,true,"SnRK2 protein kinase substrates",85,23776212,XCorr,3.7764361,1.0000000,,,,6.3681000028737E-7,
TPCVSKSQDFDSEYSR,ph,S,572,true,"atm and atr DNA damage response",88,25561503,"MASCOT Score",26.0000000,0.8990000,,,,,-0.4800000
TPCVSKSQDFDSEYSR,ph,S,572,true,"Col-0 callus - FC Col-0 vs. Col-0 Xray",111a,31410901,,52.6300000,,0.7004727,0.0000000,NO,,0.7224770
TPCVSKSQDFDSEYSR,ph,S,572,true,"Col-0 X-ray callus - FC Col-0 vs. Col-0 Xray",111b,31410901,,52.6300000,,0.7004727,0.0000000,NO,,0.7224770
TPCVSKSQDFDSEYSR,ph,S,572,true,"atm callus - FC atm vs. atm Xray",111c,31410901,,52.6300000,,0.3121113,0.0000000,NO,,0.7224770
TPCVSKSQDFDSEYSR,ph,S,572,true,"atm-3 X-ray callus - FC atm vs. atm Xray",111d,31410901,,52.6300000,,0.3121113,0.0000000,NO,,0.7224770
SQDFDSEYSR,ph,S,572,true,"STN8 phosphoproteome",38,21768351,"MASCOT Score",66.0000000,,,,,,-0.4209910
SQDFDSEYSR,ph,S,572,true,"Tyrosine phosphorylation in Arabidopsis",59,18463617,"MASCOT Score",52.0000000,,,,,,-0.5333495
SQDFDSEYSR,ph,S,572,true,"srk2dei ABA signaling phopshoproteomics",83,23572148,"MASCOT Score",64.0000000,,,,,,0.0004000
SQDFDSEYSR,ph,S,572,true,"LAXIC - mannitol vs control",84b,23660473,XCorr,2.3900000,1.0000000,,,,0.0056936899200082,
SQDFDSEYSR,ph,S,572,true,"atm and atr DNA damage response",88,25561503,"MASCOT Score",56.0000000,1.0000000,,,,,0.2300000
SQDFDSEYSR,ph,S,572,true,"TOR Kinase and ABA Receptor",100,29290610,XCorr,3.0479486,1.0000000,,,,0.022229999303818,
SQDFDSEYSR,ph,S,572,true,"Phospho cell culture sucrose/TOR",109,30833711,,,1.0000000,,,,,
SQDFDSEYSR,ph,S,572,true,"Col-0 callus - FC Col-0 vs. Col-0 Xray",111a,31410901,,49.7500000,,0.1656913,0.0000000,NO,,0.0948274
SQDFDSEYSR,ph,S,572,true,"Col-0 X-ray callus - FC Col-0 vs. Col-0 Xray",111b,31410901,,49.7500000,,0.1656913,0.0000000,NO,,0.0948274
SQDFDSEYSR,ph,S,572,true,"atm callus - FC atm vs. atm Xray",111c,31410901,,49.7500000,,-0.8010055,0.0000000,NO,,0.0948274
SQDFDSEYSR,ph,S,572,true,"atm-3 X-ray callus - FC atm vs. atm Xray",111d,31410901,,49.7500000,,-0.8010055,0.0000000,NO,,0.0948274
SQDFDSEYSR,ph,S,572,true,"Tissue atlas Arabidopsis - ProteomicsDB",114,32188942,"MaxQuant score",308.7300000,1.0000000,,,,0,
CDPLSK,sno,C,585,true,"hot5-4 / wildtype, FAT-switch S-nitrosoproteome",169,37277371,,,,,,,,
KCDPLSKSSEYFR,ph,S,591,true,"PAMP-triggered phosphorylation",48,24601666,"MASCOT Score",57.2600000,,,,,,
SSEYFR,ph,S,591,true,"srk2dei ABA signaling phopshoproteomics",83,23572148,"MASCOT Score",40.0000000,,,,,,0.0002000
KCDPLSKSSEYFR,ph,S,592,true,"Tissue atlas Arabidopsis - ProteomicsDB",114,32188942,"MaxQuant score",202.9600000,0.9546410,,,,3.6641894933351E-39,
CDPLSKSSEYFR,ph,S,592,true,"Phospho cell culture sucrose/TOR",109,30833711,,,0.7539930,,,,,
SSEYFR,ph,S,592,true,"srk2dei ABA signaling phopshoproteomics",83,23572148,"MASCOT Score",22.0000000,,,,,,-0.0003000
ALLKEGSLSF,ph,S,646,true,"Tissue atlas Arabidopsis - ProteomicsDB",114,32188942,"MaxQuant score",81.7990000,0.9964690,,,,0.0048055402003229,
