Peptide,PTM,ModifiedAA,ModifiedPosition,PeptideUniqueToGene,ExperimentDesc,ExpID,PubmedID,ScoreType,IdentScore,LocProb,Log2FChange,PQ-val,QuantSig,PEP,MassErrorPPM
STQAASTSTTPQPPPPPPPPEKTHFGGLKDEDR,nt,S,31,true,"Arg/N-end rule pathway Roots",80,25728785,"MASCOT Score",22.2300000,,,,,0.026539999991655,
STQAASTSTTPQPPPPPPPPEKTHFGGLKDEDR,nt,S,31,true,"HUNTER N-terminome: legumain, GluC and trypsin",119,31951383,"MaxQuant score",54.8410000,,,,,,
STQAASTSTTPQPPPPPPPPEKTHFGGLKDEDR,nt,S,31,true,"Mitochondrial intermediate peptidases - icp55 / WT",131a,25732537,,60.6700000,,-1.3151911,,,,
STQAASTSTTPQPPPPPPPPEKTHFGGLKDEDR,nt,S,31,true,"Mitochondrial intermediate peptidases - oct1-2 / WT",131c,25732537,,51.8100000,,-1.6478726,,,,
STQAASTSTTPQPPPPPPPPEKTHFGGLKDED,nt,S,31,true,"HUNTER N-terminome: legumain, GluC and trypsin",119,31951383,"MaxQuant score",86.7850000,,,,,,
STQAASTSTTPQPPPPPPPPEKTHFGGLKDE,nt,S,31,true,"HUNTER N-terminome: legumain, GluC and trypsin",119,31951383,"MaxQuant score",86.6750000,,,,,,
STQAASTSTTPQPPPPPPPPEKTHFGGLKD,nt,S,31,true,"HUNTER N-terminome: legumain, GluC and trypsin",119,31951383,"MaxQuant score",68.9340000,,,,,,
STQAASTSTTPQPPPPPPPPEKTHFGGLK,nt,S,31,true,"Arabidopsis translation initiation landscape - NT",167b,35069635,,,,,,,,
STQAASTSTTPQPPPPPPPPE,nt,S,31,true,"Arg/N-end rule seed, prt6 vs. Wt",99,29168982,"MASCOT Score",65.6600000,,-0.2239124,0.4700361,NO,4.9389998757476E-9,0.5160331
STQAASTSTTPQPPPPPPPPE,nt,S,31,true,"HUNTER N-terminome: legumain, GluC and trypsin",119,31951383,"MaxQuant score",143.9700000,,,,,,
STQAASTSTTPQPPPPPPPPEKTHFGGLKDEDR,nta,S,31,true,"FtsH12 N-terminome: WT / FtsH12 knockdown miRNA",118,33216923,"MaxQuant score",90.7070000,,,,,1.0300000212737E-5,
VSDGRPSYLVVNADESEPGTCK,ox,C,148,true,"Redox kickstart of mitochondria",112,31871212,,,,-1.9028054,0.0063695,YES,,
PSYLVVNADESEPGTCK,ox,C,148,true,"Redox kickstart of mitochondria",112,31871212,,,,-1.3333074,0.0181127,YES,,
VSDGRPSYLVVNADESEPGTCK,sno,C,148,true,"Site-specific nitrosomeproteomic id - gsnor1-3",90a,25699590,XCorr,3.6582897,,,,,2.3819999114494E-5,-4.5640941
LLEGCLIAGVGMR,ox,C,165,true,"Redox kickstart of mitochondria",112,31871212,,,,-1.2956849,0.0007319,YES,,
LLEGCLIAGVGMR,ox,C,165,true,"SPEAR - 10 mM H2O2 / mock",138a,34619326,,,,-1.9424491,0.0030498,YES,,
PTTVTNVETVAVSPTILR,nt,P,262,true,"Arg/N-end rule seed, prt6 vs. Wt",99,29168982,"MASCOT Score",32.2000000,,-0.8125603,0.1246406,NO,0.12110000103712,-1.7545226
NICEDVLMDFDALK,ox,C,355,true,"Redox kickstart of mitochondria",112,31871212,,,,-0.8638988,0.0030899,YES,,
STDVVDAIAR,ph,S,383,true,"SIRK1 phosphorylation",86a,23820729,"MaxQuant Score",52.5300000,0.8650000,,,,1.0160000324249,2.6240000
SCGQCTPCRE,nt,S,401,true,"N-terminal ChaFRADIC",92,26010716,"MASCOT Score",34.1900000,,,,,0.0065359999425709,
HESCGQCTPCR,sno,C,402,true,"hot5-4 / wildtype, FAT-switch S-nitrosoproteome",169,37277371,,,,,,,,
