Peptide,PTM,ModifiedAA,ModifiedPosition,PeptideUniqueToGene,ExperimentDesc,ExpID,PubmedID,ScoreType,IdentScore,LocProb,Log2FChange,PQ-val,QuantSig,PEP,MassErrorPPM
ASPAGETAAVVEGGDGQQQR,nt,A,2,true,"Arg/N-end rule seed, prt6 vs. Wt",99,29168982,"MASCOT Score",26.1500000,,,,,0.20379999279976,-1.2536557
ASPAGETAAV,nt,A,2,true,"N-term acetylation drought responses",5,26184543,,,,,,,,
ASPAGETAAVVEGGDGQQQR,nta,A,2,true,"Characterization plant N-terminal acetylation",6,22223895,"MASCOT Score",98.9000000,,,,,,
ASPAGETAAVVEGGDGQQQR,nta,A,2,true,"Arg/N-end rule seed, prt6 vs. Wt",99,29168982,"MASCOT Score",26.1500000,,,,,0.20379999279976,-1.2536557
ASPAGETAAVVEGGDGQQQR,nta,A,2,true,"FtsH12 N-terminome: WT / FtsH12 knockdown miRNA",118,33216923,"MaxQuant score",110.3800000,,,,,2.5400000706237E-14,
ASPAGETAAVVEGGDGQQQR,nta,A,2,true,"HUNTER N-terminome: legumain, GluC and trypsin",119,31951383,"MaxQuant score",201.4800000,,,,,,
ASPAGETAAVVEGGDGQQQR,nta,A,2,true,"Arabidopsis translation initiation landscape - NTA",167a,35069635,,,,,,,,
ASPAGETAAVVEGGD,nta,A,2,true,"HUNTER N-terminome: legumain, GluC and trypsin",119,31951383,"MaxQuant score",81.0170000,,,,,,
ASPAGETAAV,nta,A,2,true,"N-term acetylation drought responses",5,26184543,,,,,,,,
ASPAGETAAVVEGGDGQQQR,ph,S,3,true,"Tissue atlas Arabidopsis - ProteomicsDB",114,32188942,"MaxQuant score",102.7900000,0.9999880,,,,4.4436001545023E-9,
DSDLKDEGPVEWVSYWKPNVTINLVDDFTR,ng,N,216,true,"ER-associatied N-glycan degradation chilling stres",133,27558752,,,,,,,,
LILINETVSELPLNLEVSPISMTK,ng,N,270,true,"ER-associatied N-glycan degradation chilling stres",133,27558752,,,,,,,,
VNEFGFGGEDESVDTKK,ph,S,574,true,"Tissue atlas Arabidopsis - ProteomicsDB",114,32188942,"MaxQuant score",136.6600000,0.9980490,,,,5.2958898377753E-10,
