Peptide,PTM,ModifiedAA,ModifiedPosition,PeptideUniqueToGene,ExperimentDesc,ExpID,PubmedID,ScoreType,IdentScore,LocProb,Log2FChange,PQ-val,QuantSig,PEP,MassErrorPPM
AEVEEIAHEEQNIEKR,nt,A,2,true,"Arg/N-end rule seed, prt6 vs. Wt",99,29168982,"MASCOT Score",33.0200000,,,,,0.0027189999818802,-1.5649957
AEVEEIAHEEQNIEKR,nta,A,2,true,"Arg/N-end rule pathway Roots",80,25728785,"MASCOT Score",43.1700000,,,,,0.00025889999233186,
AEVEEIAHEEQNIEKR,nta,A,2,true,"Arg/N-end rule seed, prt6 vs. Wt",99,29168982,"MASCOT Score",33.0200000,,0.5618046,0.1315080,NO,0.0027189999818802,-1.5649957
AEVEEIAHEEQNIEKR,nta,A,2,true,"Arabidopsis translation initiation landscape - NTA",167a,35069635,,,,,,,,
AEVEEIAHEEQNIEK,nta,A,2,true,"Characterization plant N-terminal acetylation",6,22223895,"MASCOT Score",43.2700000,,,,,,
AEVEEIAHEEQNIEKR,ub,K,16,true,"Arabidopsis ubiquitination COFRADIC",40,26744219,"MaxQuant Score",119.4600000,1.0000000,,,,1.4500000346907E-28,-1.1960000
IDMQLESGEYFMSDK,ph,S,288,true,"Tissue atlas Arabidopsis - ProteomicsDB",114,32188942,"MaxQuant score",102.6900000,0.9998910,,,,1.6340900401701E-5,
SEDGKNDITELTNSLK,ph,S,348,true,"Tissue atlas Arabidopsis - ProteomicsDB",114,32188942,"MaxQuant score",407.8000000,1.0000000,,,,0,
VNAEEYIAGPSSSADKSSKK,ph,S,378,true,"Tissue atlas Arabidopsis - ProteomicsDB",114,32188942,"MaxQuant score",255.4200000,0.8807290,,,,0,
VNAEEYIAGPSSSADK,ph,S,378,true,"atm and atr DNA damage response",88,25561503,"MASCOT Score",41.0000000,0.9980000,,,,,-0.3200000
VNAEEYIAGPSSSADK,ph,S,378,true,"TOR Kinase and ABA Receptor",100,29290610,XCorr,6.0254965,0.8879000,,,,6.4079999084754E-9,
VNAEEYIAGPSSSADKSSKK,ph,S,382,true,"Tissue atlas Arabidopsis - ProteomicsDB",114,32188942,"MaxQuant score",176.2300000,0.8241710,,,,4.256540091147E-36,
