Peptide,PTM,ModifiedAA,ModifiedPosition,PeptideUniqueToGene,ExperimentDesc,ExpID,PubmedID,ScoreType,IdentScore,LocProb,Log2FChange,PQ-val,QuantSig,PEP,MassErrorPPM
LSVSQNSDPLPK,ph,S,362,true,"Tissue atlas Arabidopsis - ProteomicsDB",114,32188942,"MaxQuant score",117.7600000,0.9994650,,,,3.6053199437447E-5,
TLSSTGSVSDSPHR,ph,S,417,true,"Tissue atlas Arabidopsis - ProteomicsDB",114,32188942,"MaxQuant score",62.6580000,0.7540970,,,,0.0007560930098407,
TLSSTGSVSDSPHR,ph,S,421,true,"Tissue atlas Arabidopsis - ProteomicsDB",114,32188942,"MaxQuant score",128.7900000,0.9964450,,,,3.0496298947236E-16,
SLVRSPPRNHDENSDLISYNANR,ph,S,575,true,"Tissue atlas Arabidopsis - ProteomicsDB",114,32188942,"MaxQuant score",67.5860000,0.7679420,,,,5.6049098020594E-6,
SPPRNHDENSDLISYNANR,ph,S,579,true,"atm and atr DNA damage response",88,25561503,"MASCOT Score",41.0000000,1.0000000,,,,,-0.3400000
SLVRSPPR,ph,S,579,true,"Tissue atlas Arabidopsis - ProteomicsDB",114,32188942,"MaxQuant score",189.8800000,1.0000000,,,,0,
SLVRSPPRNHDENSDLISYNANR,ph,S,588,true,"TOR Kinase and ABA Receptor",100,29290610,XCorr,3.0302687,0.9949000,,,,0.012249999679625,
LHSLVLNR,ph,S,612,true,"Tissue atlas Arabidopsis - ProteomicsDB",114,32188942,"MaxQuant score",143.2100000,1.0000000,,,,0.0021073298994452,
