Peptide,PTM,ModifiedAA,ModifiedPosition,PeptideUniqueToGene,ExperimentDesc,ExpID,PubmedID,ScoreType,IdentScore,LocProb,Log2FChange,PQ-val,QuantSig,PEP,MassErrorPPM
VTISSSGR,nt,V,27,true,"Arg/N-end rule seed, prt6 vs. Wt",99,29168982,"MASCOT Score",34.5400000,,-0.3288700,0.0450492,NO,0.11410000175238,0.0325162
EANMLFLEAPVGVGFSYTNNSMDLQK,ng,N,146,true,"Conserved N-glycosylation",74,22633491,"MaxQuant Score",227.6600000,0.8000000,,,,0,-3.9310000
GYDPCTESYAENYFNR,nt,G,327,true,"Metacaspase9 substrates - 35S:MC9 / mc9",51b,23964026,"MASCOT Score",37.0000000,,1.2006015,,NO,,-1.1657008
GYDPCTESYAENYFNR,nt,G,327,true,"N-terminal ChaFRADIC",92,26010716,"MASCOT Score",65.3700000,,,,,1.0870000011209E-7,
GYDPCTESYAENYFNR,nt,G,327,true,"Arg/N-end rule seed, prt6 vs. Wt",99,29168982,"MASCOT Score",59.7400000,,-0.1417712,0.3135521,NO,0.00026279999292456,-1.9895394
GYDPCTESYAENYFNR,nt,G,327,true,"HUNTER N-terminome: legumain, GluC and trypsin",119,31951383,"MaxQuant score",203.1100000,,,,,,
GYDPCTESYAENYFNR,nta,G,327,true,"FtsH12 N-terminome: WT / FtsH12 knockdown miRNA",118,33216923,"MaxQuant score",76.1000000,,,,,0.026539999991655,
KDVQVALHANVTNLPYPYSPCSGVIK,ng,N,352,true,"Conserved N-glycosylation",74,22633491,"MaxQuant Score",179.9300000,0.8380000,,,,0,0.5430000
