Peptide,PTM,ModifiedAA,ModifiedPosition,PeptideUniqueToGene,ExperimentDesc,ExpID,PubmedID,ScoreType,IdentScore,LocProb,Log2FChange,PQ-val,QuantSig,PEP,MassErrorPPM
DIASSGNDIR,ph,S,102,true,"Tissue atlas Arabidopsis - ProteomicsDB",114,32188942,"MaxQuant score",96.2290000,0.9707700,,,,0.00053906999528408,
LITVESGSDDDDGVENER,ph,S,113,true,"atm and atr DNA damage response",88,25561503,"MASCOT Score",44.0000000,1.0000000,,,,,-0.9700000
LITVESGSDDDDGVENER,ph,S,113,true,"Lateral root-induction - NAA vs control",106,23328941,"MASCOT Score",41.0000000,,,,,,
LITVESGSDDDDGVENER,ph,S,113,true,"Tissue atlas Arabidopsis - ProteomicsDB",114,32188942,"MaxQuant score",154.7400000,1.0000000,,,,2.2157000040029E-21,
LITVESGSDDDDGVENER,ph,S,115,true,"atm and atr DNA damage response",88,25561503,"MASCOT Score",44.0000000,1.0000000,,,,,-0.9700000
LITVESGSDDDDGVENER,ph,S,115,true,"Lateral root-induction - NAA vs control",106,23328941,"MASCOT Score",41.0000000,,,,,,
LITVESGSDDDDGVENER,ph,S,115,true,"Tissue atlas Arabidopsis - ProteomicsDB",114,32188942,"MaxQuant score",217.3500000,1.0000000,,,,0,
YELPTDDAEYEQRK,ph,Y,351,true,"Brassinosteroid-Regulated Phosphorylation Dynamics",94,26187819,"MaxQuant Score",41.8600000,1.0000000,,,,0.050000000745058,3.8120000
YELPTDDAEYEQRK,ph,T,355,true,"Brassinosteroid-Regulated Phosphorylation Dynamics",94,26187819,"MaxQuant Score",41.8600000,1.0000000,,,,0.050000000745058,3.8120000
YELPTDDAEYEQRK,ph,Y,360,true,"Brassinosteroid-Regulated Phosphorylation Dynamics",94,26187819,"MaxQuant Score",41.8600000,1.0000000,,,,0.050000000745058,3.8120000
