Peptide,PTM,ModifiedAA,ModifiedPosition,PeptideUniqueToGene,ExperimentDesc,ExpID,PubmedID,ScoreType,IdentScore,LocProb,Log2FChange,PQ-val,QuantSig,PEP,MassErrorPPM
SQSLTNNHMSGFSSLSSSQGSVLK,ph,S,75,true,"Tissue atlas Arabidopsis - ProteomicsDB",114,32188942,"MaxQuant score",84.1520000,0.9897060,,,,3.8826199200148E-12,
SQSLTNNHMSGFSSLSSSQGSVLK,fuc,S,82,true,"SPINDLY O-fucosylation",162,36739885,,,,,,,-0.28000000119209,
SQSFMDMIR,ph,S,99,true,"atm and atr DNA damage response",88,25561503,"MASCOT Score",34.0000000,1.0000000,,,,,-1.1500000
SQSFMDMIR,ph,S,99,true,"Tissue atlas Arabidopsis - ProteomicsDB",114,32188942,"MaxQuant score",85.8130000,0.9995600,,,,0.0013613000046462,
GSSQEDDLDDEEDFIMKK,ph,S,111,true,"Tissue atlas Arabidopsis - ProteomicsDB",114,32188942,"MaxQuant score",212.4100000,0.9965930,,,,0,
GSSQEDDLDDEEDFIMK,ph,S,111,true,"atm and atr DNA damage response",88,25561503,"MASCOT Score",61.0000000,0.9750000,,,,,-1.2200000
ESSSTSQSHRVDLR,ph,S,128,true,"Tissue atlas Arabidopsis - ProteomicsDB",114,32188942,"MaxQuant score",55.3140000,0.9866990,,,,0.0060963598079979,
ADVRGSPNDQKLNTPR,ph,S,148,true,"Tissue atlas Arabidopsis - ProteomicsDB",114,32188942,"MaxQuant score",114.8800000,1.0000000,,,,6.5941996751917E-8,
ADVRGSPNDQKLNTPR,ph,T,156,true,"Tissue atlas Arabidopsis - ProteomicsDB",114,32188942,"MaxQuant score",66.5200000,1.0000000,,,,0.0012337999651209,
VASSEAVEPSPSSR,ph,S,308,true,"Tissue atlas Arabidopsis - ProteomicsDB",114,32188942,"MaxQuant score",121.9200000,0.9763510,,,,3.7961901398376E-5,
VASSEAVEPSPSSR,ph,S,315,true,"Lateral root-induction - NAA vs control",106,23328941,"MASCOT Score",37.0000000,,,,,,
VASSEAVEPSPSSR,ph,S,315,true,"Tissue atlas Arabidopsis - ProteomicsDB",114,32188942,"MaxQuant score",202.3200000,0.8322840,,,,5.863032774735E-42,
VASSEAVEPSPSSR,ph,S,317,true,"Lateral root-induction - NAA vs control",106,23328941,"MASCOT Score",27.0000000,,,,,,
SQKEEEDEEVLEGNIR,ph,S,320,true,"atm and atr DNA damage response",88,25561503,"MASCOT Score",75.0000000,1.0000000,,,,,-0.0800000
SQKEEEDEEVLEGNIR,ph,S,320,true,"Tissue atlas Arabidopsis - ProteomicsDB",114,32188942,"MaxQuant score",398.9700000,1.0000000,,,,0,
SQKEEEDEEVLEGNIR,ph,S,320,true,"Touch-induced phosphorylation: 40s touch vs untouc",136,30291188,"MASCOT score",108.8400000,,0.0202476,0.8954026,NO,,-4.3782168
QSSSSSFKDHEVR,ph,S,378,true,"Tissue atlas Arabidopsis - ProteomicsDB",114,32188942,"MaxQuant score",63.4360000,0.9030980,,,,0.0014965300215408,
