Peptide,PTM,ModifiedAA,ModifiedPosition,PeptideUniqueToGene,ExperimentDesc,ExpID,PubmedID,ScoreType,IdentScore,LocProb,Log2FChange,PQ-val,QuantSig,PEP,MassErrorPPM
MNDLLKGSFELPR,nta,M,1,true,"Arg/N-end rule pathway Roots",80,25728785,"MASCOT Score",56.8500000,,,,,8.8280000909435E-7,
MNDLLKGSFELPR,nta,M,1,true,"N-terminal ChaFRADIC",92,26010716,"MASCOT Score",23.1600000,,,,,0.00025660000392236,
MNDLLKGSFELPR,nta,M,1,true,"Arg/N-end rule seed, prt6 vs. Wt",99,29168982,"MASCOT Score",36.9400000,,0.0335880,0.8611143,NO,0.0031870000530034,-1.5371272
MNDLLKGSFELPR,nta,M,1,true,"FtsH12 N-terminome: WT / FtsH12 knockdown miRNA",118,33216923,"MaxQuant score",82.1710000,,,,,0.011730000376701,
MNDLLKGSFELPR,nta,M,1,true,"HUNTER N-terminome: legumain, GluC and trypsin",119,31951383,"MaxQuant score",97.2140000,,,,,,
MNDLLKGSFELPR,nta,M,1,true,"Arabidopsis translation initiation landscape - NTA",167a,35069635,,,,,,,,
MNDLLKGSFE,nta,M,1,true,"N-term acetylation drought responses",5,26184543,,,,,,,,
MNDLLKGSF,nta,M,1,true,"Arg/N-end rule pathway Roots",80,25728785,"MASCOT Score",26.9300000,,,,,0.058320000767708,
MNDLLKGSFELPR,ph,S,8,true,"Phosphorylation Early Elicitor Signaling",23,17317660,,,,,,,,
MNDLLKGSFELPR,ph,S,8,true,"Tissue atlas Arabidopsis - ProteomicsDB",114,32188942,"MaxQuant score",201.5700000,1.0000000,,,,2.4375698890807E-39,
NDLLKGSFELPR,ph,S,8,true,"Phosphorylation Early Elicitor Signaling",23,17317660,,,,,,,,
GSFELPR,ph,S,8,true,"Plasmamembrane phosphorylation",20,15308754,,,,,,,,
GSFELPR,ph,S,8,true,"Phosphorylation Early Elicitor Signaling",23,17317660,,,,,,,,
GSFELPRGQSSREGDVELGEQQGGDQGLEDFFK,ph,S,16,true,"MAPK Arabidopsis substrates",45,23172892,"MaxQuant Score",89.8910000,,,,,,
GQSSREGDVELGEQQGGDQGLEDFFKK,ph,S,16,true,"Arabidopsis root NAA phosphoproteome",18a,27643528,"MaxQuant Score",122.8100000,0.7990000,,,,3.4379999232086E-19,-0.6100000
GQSSREGDVELGEQQGGDQGLEDFFKK,ph,S,16,true,"SnRK2 protein kinase substrates",85,23776212,XCorr,3.0391827,0.8050000,,,,1.1065099947416E-8,
GQSSREGDVELGEQQGGDQGLEDFFKK,ph,S,16,true,"Tissue atlas Arabidopsis - ProteomicsDB",114,32188942,"MaxQuant score",180.1400000,0.8207290,,,,0,
GQSSREGDVELGEQQGGDQGLEDFFK,ph,S,16,true,"Phosphorylation Early Elicitor Signaling",23,17317660,,,,,,,,
GQSSREGDVELGEQQGGDQGLEDFFK,ph,S,16,true,"ABA-induced protein phosphorylation",35,20733066,,,,,,,,
GQSSREGDVELGEQQGGDQGLEDFFK,ph,S,16,true,"srk2dei ABA signaling phopshoproteomics",83,23572148,"MASCOT Score",96.0000000,,,,,,-0.0019000
GSFELPRGQSSR,ph,S,16,true,"STN8 phosphoproteome",38,21768351,"MASCOT Score",46.7600000,,,,,,-0.2599690
GQSSREGDVELGEQQGGDQGLEDFFK,ph,S,17,true,"srk2dei ABA signaling phopshoproteomics",83,23572148,"MASCOT Score",101.0000000,,,,,,0.0013000
VQVIDKQYDKLDK,ub,K,46,true,"Ubiquitination Membrane Proteins",120,33585938,,,,,,,,
VQVIDKQYDK,ub,K,46,true,"upl3 mutant / wildtype",168,35926874,"MaxQuant score",72.3210000,1.0000000,0.7101727,,,0.0014682000037283,0.4576000
LQASHEESKSVTK,ph,S,67,true,"Tissue atlas Arabidopsis - ProteomicsDB",114,32188942,"MaxQuant score",100.5800000,0.7594570,,,,5.5793800129322E-5,
