Peptide,PTM,ModifiedAA,ModifiedPosition,PeptideUniqueToGene,ExperimentDesc,ExpID,PubmedID,ScoreType,IdentScore,LocProb,Log2FChange,PQ-val,QuantSig,PEP,MassErrorPPM
AKSVSTAASSLVQNLR,nt,A,2,true,"Arg/N-end rule seed, prt6 vs. Wt",99,29168982,"MASCOT Score",90.4500000,,,,,8.8740000592225E-7,-1.2773337
AKSVSTAASSLVQNLR,nt,A,2,true,"FtsH12 N-terminome: WT / FtsH12 knockdown miRNA",118,33216923,"MaxQuant score",69.7470000,,,,,0.00040503000491299,
AKSVSTAASSLVQN,nt,A,2,true,"Arg/N-end rule seed, prt6 vs. Wt",99,29168982,"MASCOT Score",64.9900000,,,,,6.0449997363321E-7,3.9800718
AKSVSTAASSLVQ,nt,A,2,true,"Arg/N-end rule seed, prt6 vs. Wt",99,29168982,"MASCOT Score",58.3100000,,,,,5.4240001190919E-5,-1.6099176
AKSVSTAASSL,nt,A,2,true,"Arg/N-end rule seed, prt6 vs. Wt",99,29168982,"MASCOT Score",55.2900000,,,,,0.031899999827147,-1.4787981
AKSVSTAASS,nt,A,2,true,"N-term acetylation drought responses",5,26184543,,,,,,,,
AKSVSTAASSLVQNLRR,nta,A,2,true,"Arg/N-end rule pathway Roots",80,25728785,"MASCOT Score",35.4000000,,,,,0.11379999667406,
AKSVSTAASSLVQNLR,nta,A,2,true,"Arg/N-end rule pathway Roots",80,25728785,"MASCOT Score",85.6300000,,,,,7.3939998568306E-10,
AKSVSTAASSLVQNLR,nta,A,2,true,"Arg/N-end rule seed, prt6 vs. Wt",99,29168982,"MASCOT Score",90.4500000,,-0.2336009,0.0650829,NO,8.8740000592225E-7,-1.2773337
AKSVSTAASSLVQNLR,nta,A,2,true,"HUNTER N-terminome: legumain, GluC and trypsin",119,31951383,"MaxQuant score",79.3940000,,,,,,
AKSVSTAASSLVQNLR,nta,A,2,true,"Arabidopsis translation initiation landscape - NTA",167a,35069635,,,,,,,,
AKSVSTAASSLVQN,nta,A,2,true,"Arg/N-end rule seed, prt6 vs. Wt",99,29168982,"MASCOT Score",64.9900000,,0.1016107,0.7498859,NO,6.0449997363321E-7,3.9800718
AKSVSTAASSLVQ,nta,A,2,true,"Arg/N-end rule seed, prt6 vs. Wt",99,29168982,"MASCOT Score",58.3100000,,-0.6761728,0.0163130,NO,5.4240001190919E-5,-1.6099176
AKSVSTAASSL,nta,A,2,true,"Arg/N-end rule seed, prt6 vs. Wt",99,29168982,"MASCOT Score",55.2900000,,-0.2726676,0.0901066,NO,0.031899999827147,-1.4787981
AKSVSTAASS,nta,A,2,true,"N-term acetylation drought responses",5,26184543,,,,,,,,
DNVVQMMNEKK,ac,K,101,true,"Quantitative Acetylproteomics",101,29440448,,,,,,,,
KSFDVSDFPK,ph,S,103,true,"atm and atr DNA damage response",88,25561503,"MASCOT Score",55.0000000,1.0000000,,,,,-2.8300000
SFDVSDFPK,ph,S,103,true,"STN8 phosphoproteome",38,21768351,"MASCOT Score",41.4900000,,,,,,0.8905580
