Peptide,PTM,ModifiedAA,ModifiedPosition,PeptideUniqueToGene,ExperimentDesc,ExpID,PubmedID,ScoreType,IdentScore,LocProb,Log2FChange,PQ-val,QuantSig,PEP,MassErrorPPM
KPSPSAATRTITSK,ph,T,26,true,"atm and atr DNA damage response",88,25561503,"MASCOT Score",35.0000000,1.0000000,,,,,-1.2800000
KPSPSAATRTITSK,ph,T,26,true,"TOR Kinase and ABA Receptor",100,29290610,XCorr,3.6636219,0.9252000,,,,0.0097629996016622,
KPSPSAATR,ph,T,26,true,"atm and atr DNA damage response",88,25561503,"MASCOT Score",28.0000000,0.9970000,,,,,-1.1900000
KPSPSAATRTITSK,ph,T,28,true,"atm and atr DNA damage response",88,25561503,"MASCOT Score",35.0000000,0.9920000,,,,,-1.2800000
KPSPSAATRTITSK,ph,T,28,true,"TOR Kinase and ABA Receptor",100,29290610,XCorr,3.6636219,0.8309000,,,,0.0097629996016622,
KSTATPQVK,ph,S,34,true,"atm and atr DNA damage response",88,25561503,"MASCOT Score",30.0000000,0.9520000,,,,,-2.6200000
STATPQVK,ph,S,34,true,"atm and atr DNA damage response",88,25561503,"MASCOT Score",33.0000000,0.9950000,,,,,-1.7800000
KSTATPQVK,ph,T,35,true,"atm and atr DNA damage response",88,25561503,"MASCOT Score",30.0000000,0.9960000,,,,,0.0900000
STATPQVKLLTR,ac,K,41,true,"Histone deacetylases - apicidin vs control",98a,29061669,"MaxQuant Score",65.2000000,1.0000000,0.1340000,0.5610480,NO,0.0049999998882413,
STATPQVKLLTR,ac,K,41,true,"Histone deacetylases - hda14 vs WT (thylakoids)",98d,29061669,"MaxQuant Score",84.4000000,1.0000000,1.3600000,0.2269865,NO,0.00031800000579096,
STATPQVKLLTR,ac,K,41,true,"Histone deacetylases substrates - hda14 vs WT",98e,29061669,"MaxQuant Score",40.5000000,1.0000000,2.0700000,0.0939723,NO,0.0080000003799796,
VEQLKLLTK,ac,K,50,true,"Histone deacetylases - apicidin vs control",98a,29061669,"MaxQuant Score",121.7000000,1.0000000,0.1580000,0.6839116,NO,0.0060000000521541,
VEQLKLLTK,ac,K,50,true,"Histone deacetylases - hda14 vs WT (thylakoids)",98d,29061669,"MaxQuant Score",68.8000000,1.0000000,-0.1470000,0.9183326,NO,0.020999999716878,
LLTKAEK,ac,K,54,true,"Quantitative Acetylproteomics",101,29440448,,,,,,,,
AEKAGLLSLAEK,ac,K,57,true,"Histone deacetylases - apicidin vs control",98a,29061669,"MaxQuant Score",91.1000000,1.0000000,-0.0740000,0.6902398,NO,0.003000000026077,
AEKAGLLSLAEK,ac,K,57,true,"Histone deacetylases - hda14 vs WT (thylakoids)",98d,29061669,"MaxQuant Score",94.1000000,1.0000000,2.7250000,0.1145513,NO,0.00027099999715574,
AGLLSLAEK,ph,S,62,true,"Tissue atlas Arabidopsis - ProteomicsDB",114,32188942,"MaxQuant score",73.7810000,1.0000000,,,,0.006969990208745,
SGFSLSTIER,ph,S,67,true,"STN8 phosphoproteome",38,21768351,"MASCOT Score",47.0500000,,,,,,0.5448810
SGFSLSTIER,ph,S,70,true,"atm and atr DNA damage response",88,25561503,"MASCOT Score",45.0000000,1.0000000,,,,,0.5600000
SGFSLSTIER,ph,S,70,true,"Tissue atlas Arabidopsis - ProteomicsDB",114,32188942,"MaxQuant score",186.4600000,0.9999720,,,,4.0893899377892E-10,
SGFSLSTIER,ph,S,70,true,"Touch-induced phosphorylation: 40s touch vs untouc",136,30291188,"MASCOT score",59.9400000,,-0.2447053,0.3760113,NO,,5.6413019
SGFSLSTIER,ph,S,72,true,"Tissue atlas Arabidopsis - ProteomicsDB",114,32188942,"MaxQuant score",77.5970000,0.8160390,,,,0.0035646699834615,
SGFSLSTIERLGLLTK,ph,T,73,true,"Phosphoproteome ethylene-regulated time response",46,24043427,"MASCOT Score",80.5600000,,,,,,31.8884000
SGFSLSTIER,ph,T,73,true,"Phosphoproteome ethylene-regulated time response",46,24043427,"MASCOT Score",46.3900000,,,,,,5.5891000
SGFSLSTIER,ph,T,73,true,"srk2dei ABA signaling phopshoproteomics",83,23572148,"MASCOT Score",43.0000000,,,,,,-0.0003000
SGFSLSTIER,ph,T,73,true,"atm and atr DNA damage response",88,25561503,"MASCOT Score",54.0000000,0.9300000,,,,,-0.5500000
SGFSLSTIER,ph,T,73,true,"TOR Kinase and ABA Receptor",100,29290610,XCorr,3.8586838,0.9444000,,,,1.596000038262E-5,
SGFSLSTIER,ph,T,73,true,"Phospho cell culture sucrose/TOR",109,30833711,,,0.8299980,,,,,
SGFSLSTIER,ph,T,73,true,"Tissue atlas Arabidopsis - ProteomicsDB",114,32188942,"MaxQuant score",185.2500000,0.9664390,,,,1.5634500361017E-9,
SGFSLSTIER,ph,T,73,true,"Touch-induced phosphorylation: 40s touch vs untouc",136,30291188,"MASCOT score",76.8700000,,-0.1562337,0.0583231,NO,,5.6413019
