Peptide,PTM,ModifiedAA,ModifiedPosition,PeptideUniqueToGene,ExperimentDesc,ExpID,PubmedID,ScoreType,IdentScore,LocProb,Log2FChange,PQ-val,QuantSig,PEP,MassErrorPPM
MNALAATNRNFR,nta,M,1,true,"Mitochondrial intermediate peptidases - icp55 / WT",131a,25732537,,46.4000000,,,,,,
MNALAATNRN,nta,M,1,false,"N-term acetylation drought responses",5,26184543,,,,,,,,
MNALAATNR,nta,M,1,false,"Characterization plant N-terminal acetylation",6,22223895,"MASCOT Score",68.9400000,,,,,,
MNALAATNR,nta,M,1,false,"Arg/N-end rule pathway Roots",80,25728785,"MASCOT Score",62.0300000,,,,,0.0032949999440461,
MNALAATNR,nta,M,1,false,"Stromal N-terminome",96,26371235,"MASCOT Score",48.1500000,,,,,,
MNALAATNR,nta,M,1,false,"Arg/N-end rule seed, prt6 vs. Wt",99,29168982,"MASCOT Score",59.7800000,,,,,0.030840000137687,0.5709688
MNALAATNR,nta,M,1,false,"FtsH12 N-terminome: WT / FtsH12 knockdown miRNA",118,33216923,"MaxQuant score",80.0610000,,,,,4.7899999938705E-12,
MNALAATNR,nta,M,1,false,"HUNTER N-terminome: legumain, GluC and trypsin",119,31951383,"MaxQuant score",138.5400000,,,,,,
MNALAATNR,nta,M,1,false,"Mitochondrial intermediate peptidases - oct1-1 / WT",131b,25732537,,73.7200000,,,,,,
MNALAATNR,nta,M,1,false,"Mitochondrial intermediate peptidases - oct1-2 / WT",131c,25732537,,65.5900000,,,,,,
MNALAATNR,nta,M,1,false,"Arabidopsis translation initiation landscape - NTA",167a,35069635,,,,,,,,
NALAATNR,nt,N,2,false,"Arabidopsis translation initiation landscape - NT",167b,35069635,,,,,,,,
MNALAATNR,ph,T,7,false,"BSK8 and BSL2 regulating sucrose-ph synthase",66,24924143,"MaxQuant Score",68.3550000,,,,,,-0.5130000
ILGLDSKIER,ph,S,22,true,"Tissue atlas Arabidopsis - ProteomicsDB",114,32188942,"MaxQuant score",69.6020000,1.0000000,,,,0.01187099982053,
ILGLDSKIER,ac,K,23,true,"Quantitative Acetylproteomics",101,29440448,,,,,,,,
SLMIPFR,nt,S,27,true,"Arabidopsis translation initiation landscape - NT",167b,35069635,,,,,,,,
VECTIPK,sno,C,39,false,"hot5-4 / wildtype, FAT-switch S-nitrosoproteome",169,37277371,,,,,,,,
VECTIPK,so,C,39,false,"S-sulfenylation site detection using YAP1C",110,32714340,,,,,,,,
GPMKGGIR,nt,G,63,false,"Arabidopsis translation initiation landscape - NT",167b,35069635,,,,,,,,
GGIGCSPR,sno,C,107,true,"hot5-4 / wildtype, FAT-switch S-nitrosoproteome",169,37277371,,,,,,,,
GGIGCSPR,ph,S,108,true,"Tissue atlas Arabidopsis - ProteomicsDB",114,32188942,"MaxQuant score",76.2280000,1.0000000,,,,0.010744499973953,
DLSLSELER,ph,S,113,true,"Tissue atlas Arabidopsis - ProteomicsDB",114,32188942,"MaxQuant score",69.6720000,0.9982090,,,,0.0061723701655865,
DLSLSELER,ph,S,115,true,"Phospho cell culture sucrose/TOR",109,30833711,,,0.9914640,,,,,
DLSLSELER,ph,S,115,true,"Tissue atlas Arabidopsis - ProteomicsDB",114,32188942,"MaxQuant score",84.6580000,0.9997050,,,,0.003215909935534,
TDVPAPDMGTN,nt,T,136,true,"N-terminal ChaFRADIC",92,26010716,"MASCOT Score",20.1600000,,,,,0.0044689998030663,
NPEGIDINALIKHK,ac,K,255,true,"Quantitative Acetylproteomics",101,29440448,,,,,,,,
ENAGDVKAK,ac,K,303,true,"Quantitative Acetylproteomics",101,29440448,,,,,,,,
TMCHTHSCNLR,so,C,381,true,"Arabidopsis S-sulfenylation chemoproteomics",108,31578252,"pFind PSM Score",0.0864881,,1.0101000,,,,-1.2735348
TMCHTHSCNLR,ph,S,385,true,"Phospho cell culture sucrose/TOR",109,30833711,,,0.9941410,,,,,
TMCHTHSCNLR,ph,S,385,true,"Tissue atlas Arabidopsis - ProteomicsDB",114,32188942,"MaxQuant score",71.0310000,0.9831230,,,,0.00070625200169161,
