Peptide,PTM,ModifiedAA,ModifiedPosition,PeptideUniqueToGene,ExperimentDesc,ExpID,PubmedID,ScoreType,IdentScore,LocProb,Log2FChange,PQ-val,QuantSig,PEP,MassErrorPPM
DLCNQNDK,sno,C,25,true,"hot5-4 / wildtype, FAT-switch S-nitrosoproteome",169,37277371,,,,,,,,
SWDPQTDCC,nt,S,48,true,"N-terminal ChaFRADIC",92,26010716,"MASCOT Score",39.5900000,,,,,1.6500000128872E-5,
EVGDLPYLETLVFR,nt,E,89,true,"Tic56 chloroplast import - tic56-1",89c,25588737,XCorr,2.8974411,,,,,,
KLSNLTGTIQPTIAK,ng,N,106,true,"ER-associatied N-glycan degradation chilling stres",133,27558752,,,,,,,,
KLSNLTGTIQPTIAK,ng,N,106,true,"UDP-GlcNAc transporter glycopeptide analysis",135,30224661,,,,,,,4.0626701823323E-16,0.8000000
LSNLTGTIQPTIAK,ng,N,106,true,"Conserved N-glycosylation",74,22633491,"MaxQuant Score",171.9700000,1.0000000,,,,9.1939192244351E-42,0.1680000
LSNLTGTIQPTIAK,ng,N,106,true,"N-linked Glycan Micro-heterogeneity Arabidopsis",134,29237727,,,,,,,,
LSNLTGTIQPTIAK,ng,N,106,true,"UDP-GlcNAc transporter glycopeptide analysis",135,30224661,,,,,,,4.2416097760858E-13,0.5000000
LSWTNLTGPIPDFISQLK,ng,N,130,true,"Conserved N-glycosylation",74,22633491,"MaxQuant Score",67.3060000,1.0000000,,,,0.014999999664724,0.3340000
ILALELSRNK,ph,S,175,true,"Tissue atlas Arabidopsis - ProteomicsDB",114,32188942,"MaxQuant score",43.5440000,1.0000000,,,,0.017054500058293,
GSIPESFGSFPGTVPDLR,nt,G,181,true,"Tic56 chloroplast import - tic56-1",89c,25588737,XCorr,3.5625591,,,,,,
SFGSFPGTVPD,nt,S,186,true,"N-terminal ChaFRADIC",92,26010716,"MASCOT Score",44.1800000,,,,,0.048820000141859,
LSHNQLSGPIPKSLGNIDFNR,ac,K,210,true,"Quantitative Acetylproteomics",101,29440448,,,,,,,,
LQGDASMLFGSNK,ng,N,238,true,"Conserved N-glycosylation",74,22633491,"MaxQuant Score",121.9500000,1.0000000,,,,1.2990000186619E-9,0.1690000
LQGDASMLFGSNK,ng,N,238,true,"ER-associatied N-glycan degradation chilling stres",133,27558752,,,,,,,,
LCGHIPTGGK,sno,C,298,true,"hot5-4 / wildtype, FAT-switch S-nitrosoproteome",169,37277371,,,,,,,,
CLCGAPLEICK,sno,C,320,true,"hot5-4 / wildtype, FAT-switch S-nitrosoproteome",169,37277371,,,,,,,,
