Peptide,PTM,ModifiedAA,ModifiedPosition,PeptideUniqueToGene,ExperimentDesc,ExpID,PubmedID,ScoreType,IdentScore,LocProb,Log2FChange,PQ-val,QuantSig,PEP,MassErrorPPM
QLLNNVHNDDLIKR,ac,K,70,true,"Quantitative Acetylproteomics",101,29440448,,,,,,,,
HQSLDVHPSPTFSASR,ph,S,88,true,"Tissue atlas Arabidopsis - ProteomicsDB",114,32188942,"MaxQuant score",102.6600000,0.9999970,,,,1.0808199704115E-6,
HQSLDVHPSPTFSASR,ph,S,94,true,"MAPK Arabidopsis substrates",45,23172892,"MaxQuant Score",106.2800000,,,,,,
HQSLDVHPSPTFSASR,ph,S,94,true,"atm and atr DNA damage response",88,25561503,"MASCOT Score",61.0000000,1.0000000,,,,,0.7700000
HQSLDVHPSPTFSASR,ph,S,94,true,"Phospho cell culture sucrose/TOR",109,30833711,,,0.9858340,,,,,
HQSLDVHPSPTFSASR,ph,S,94,true,"Col-0 callus - FC Col-0 vs. Col-0 Xray",111a,31410901,,24.1100000,,0.7205533,0.0000000,NO,,0.3808206
HQSLDVHPSPTFSASR,ph,S,94,true,"Col-0 X-ray callus - FC Col-0 vs. Col-0 Xray",111b,31410901,,24.1100000,,0.7205533,0.0000000,NO,,0.3808206
HQSLDVHPSPTFSASR,ph,S,94,true,"atm callus - FC atm vs. atm Xray",111c,31410901,,24.1100000,,0.3065839,0.0000000,NO,,0.3808206
HQSLDVHPSPTFSASR,ph,S,94,true,"atm-3 X-ray callus - FC atm vs. atm Xray",111d,31410901,,24.1100000,,0.3065839,0.0000000,NO,,0.3808206
HQSLDVHPSPTFSASR,ph,S,94,true,"Tissue atlas Arabidopsis - ProteomicsDB",114,32188942,"MaxQuant score",159.7200000,0.9988450,,,,2.3499399380068E-14,
HQSLDVHPSPTFSASR,ph,T,96,true,"MAPK Arabidopsis substrates",45,23172892,"MaxQuant Score",119.4600000,,,,,,
HQSLDVHPSPTFSASR,ph,T,96,true,"Tissue atlas Arabidopsis - ProteomicsDB",114,32188942,"MaxQuant score",137.1200000,0.9178550,,,,1.7775899863182E-8,
HQSLDVHPSPTFSASR,ph,S,98,true,"atm and atr DNA damage response",88,25561503,"MASCOT Score",63.0000000,1.0000000,,,,,-0.1500000
TFQSYPSIGSTR,ph,S,112,true,"MAPK Arabidopsis substrates",45,23172892,"MaxQuant Score",92.8560000,,,,,,
TFQSYPSIGSTR,ph,S,112,true,"SnRK2 protein kinase substrates",85,23776212,XCorr,2.3809681,0.9930000,,,,0.0033584199845791,
TFQSYPSIGSTR,ph,S,112,true,"atm and atr DNA damage response",88,25561503,"MASCOT Score",26.0000000,1.0000000,,,,,-3.1800000
TFQSYPSIGSTR,ph,S,112,true,"TOR Kinase and ABA Receptor",100,29290610,XCorr,3.3127267,0.9995000,,,,0.0098839998245239,
TFQSYPSIGSTR,ph,S,112,true,"Phospho cell culture sucrose/TOR",109,30833711,,,0.9038020,,,,,
TFQSYPSIGSTR,ph,S,112,true,"Tissue atlas Arabidopsis - ProteomicsDB",114,32188942,"MaxQuant score",166.0300000,0.9862480,,,,1.5718400566593E-14,
SKSFNNRVVSANEPAEALIGR,ph,S,118,true,"MAPK Arabidopsis substrates",45,23172892,"MaxQuant Score",111.6600000,,,,,,
VVSANEPAEALIGR,ph,S,127,true,"Tissue atlas Arabidopsis - ProteomicsDB",114,32188942,"MaxQuant score",66.3350000,1.0000000,,,,0.002056929981336,
LTDASDYESDGEEPYSHELPMLLG,ph,S,305,true,"SnRK2 protein kinase substrates",85,23776212,XCorr,2.1994417,0.8290000,,,,0.17861799895763,
LTDASDYESDGEEPYSHELPMLLG,ph,S,305,true,"TOR Kinase and ABA Receptor",100,29290610,XCorr,4.5318809,0.9506000,,,,0.003973999992013,
