Peptide,PTM,ModifiedAA,ModifiedPosition,PeptideUniqueToGene,ExperimentDesc,ExpID,PubmedID,ScoreType,IdentScore,LocProb,Log2FChange,PQ-val,QuantSig,PEP,MassErrorPPM
MQSMKETASNIAASAK,ph,S,3,true,"Tissue atlas Arabidopsis - ProteomicsDB",114,32188942,"MaxQuant score",244.8900000,1.0000000,,,,0,
ETASNIAASAK,ph,S,9,true,"Tissue atlas Arabidopsis - ProteomicsDB",114,32188942,"MaxQuant score",95.4170000,0.9995460,,,,0.00011693200212903,
ETASNIAASAK,ph,S,14,true,"Tissue atlas Arabidopsis - ProteomicsDB",114,32188942,"MaxQuant score",106.3900000,0.9986980,,,,4.0603201341582E-5,
VVEGTAVTDPIGR,nt,V,116,true,"Metacaspase9 substrates - in vitro rMC9",51c,23964026,"MASCOT Score",93.0000000,,5.9092180,,NO,,-0.1446403
VVEGTAVTDPIGR,ph,T,120,true,"Tissue atlas Arabidopsis - ProteomicsDB",114,32188942,"MaxQuant score",186.5600000,1.0000000,,,,8.3168598019847E-22,
VVEGTAVTDPIGR,ph,T,123,true,"Tissue atlas Arabidopsis - ProteomicsDB",114,32188942,"MaxQuant score",170.7400000,0.9997160,,,,1.2173300019923E-14,
TTAHNTHVGGGGATGYGTGGGYTG,ph,T,140,true,"Tissue atlas Arabidopsis - ProteomicsDB",114,32188942,"MaxQuant score",127.4200000,0.8922970,,,,2.0899800792712E-27,
TTAHNTHVGGGGATGYGTGGGYTG,ph,T,148,true,"Tissue atlas Arabidopsis - ProteomicsDB",114,32188942,"MaxQuant score",134.5100000,0.9422630,,,,1.3883699492715E-34,
TTAHNTHVGGGGATGYGTGGGYTG,ph,Y,156,true,"Tissue atlas Arabidopsis - ProteomicsDB",114,32188942,"MaxQuant score",85.8050000,0.9571220,,,,5.1179299513648E-12,
TTAHNTHVGGGGATGYGTGGGYTG,ph,T,157,true,"Tissue atlas Arabidopsis - ProteomicsDB",114,32188942,"MaxQuant score",397.3100000,1.0000000,,,,0,
