Peptide,PTM,ModifiedAA,ModifiedPosition,PeptideUniqueToGene,ExperimentDesc,ExpID,PubmedID,ScoreType,IdentScore,LocProb,Log2FChange,PQ-val,QuantSig,PEP,MassErrorPPM
TVESSASSTTSSSK,ph,S,22,true,"Tissue atlas Arabidopsis - ProteomicsDB",114,32188942,"MaxQuant score",101.7500000,0.7942470,,,,0.00012187699758215,
LYQEASVDSHSSPTSSSVR,ph,S,44,true,"Large-scale phosphorylation discovery",44,23111157,XCorr,3.3160000,,,,,,
LYQEASVDSHSSPTSSSVR,ph,S,44,true,"atm and atr DNA damage response",88,25561503,"MASCOT Score",40.0000000,0.9890000,,,,,-0.0200000
LYQEASVDSHSSPTSSSVR,ph,S,44,true,"Tissue atlas Arabidopsis - ProteomicsDB",114,32188942,"MaxQuant score",199.6100000,0.9821100,,,,0,
KGEEIAWYADGETIVRNENNQSIAYAYDR,ph,T,95,true,"Phospho cell culture sucrose/TOR",109,30833711,,,0.7606250,,,,,
RRHSFGEEELAYLPHK,ph,S,498,true,"TOR Kinase and ABA Receptor",100,29290610,XCorr,3.8110895,1.0000000,,,,0.00029799999902025,
RHSFGEEELAYLPHK,ph,S,498,true,"atm and atr DNA damage response",88,25561503,"MASCOT Score",32.0000000,1.0000000,,,,,0.6100000
RHSFGEEELAYLPHK,ph,S,498,true,"TOR Kinase and ABA Receptor",100,29290610,XCorr,5.1124649,1.0000000,,,,1.8299999737792E-6,
RHSFGEEELAYLPHK,ph,S,498,true,"Tissue atlas Arabidopsis - ProteomicsDB",114,32188942,"MaxQuant score",130.5600000,1.0000000,,,,6.9254701884347E-7,
SNSTPSTPQGEGSDFHTESR,ph,S,577,true,"Tissue atlas Arabidopsis - ProteomicsDB",114,32188942,"MaxQuant score",120.8500000,0.9225200,,,,2.5228199700228E-17,
EAHEDSFHEIETPETR,ph,S,618,true,"atm and atr DNA damage response",88,25561503,"MASCOT Score",59.0000000,1.0000000,,,,,-0.2000000
EAHEDSFHEIETPETR,ph,S,618,true,"TOR Kinase and ABA Receptor",100,29290610,XCorr,2.7076681,1.0000000,,,,0.003493000054732,
EAHEDSFHEIETPETR,ph,S,618,true,"Tissue atlas Arabidopsis - ProteomicsDB",114,32188942,"MaxQuant score",183.6500000,1.0000000,,,,3.3797801778522E-27,
EAHEDSFHEIETPETR,ph,T,624,true,"Tissue atlas Arabidopsis - ProteomicsDB",114,32188942,"MaxQuant score",61.7670000,0.9866730,,,,0.00038526201387867,
KLAEESSYAK,me2,K,827,false,"Arabidopsis protein methylome",123,31809900,"MaxQuant Score",171.6700000,1.0000000,,,,0,-0.1307500
KLAEESSYAK,me3,K,827,false,"Arabidopsis protein methylome",123,31809900,"MaxQuant Score",66.2670000,1.0000000,,,,0.0079742297530174,0.7447000
