Peptide,PTM,ModifiedAA,ModifiedPosition,PeptideUniqueToGene,ExperimentDesc,ExpID,PubmedID,ScoreType,IdentScore,LocProb,Log2FChange,PQ-val,QuantSig,PEP,MassErrorPPM
MDLAIVSSPTR,ph,S,8,true,"atm and atr DNA damage response",88,25561503,"MASCOT Score",62.0000000,0.9260000,,,,,0.5100000
MDLAIVSSPTR,ph,S,8,true,"Tissue atlas Arabidopsis - ProteomicsDB",114,32188942,"MaxQuant score",199.8000000,0.8152230,,,,8.611100103163E-20,
MMSFGFTEAEVETEK,ph,T,182,true,"Tissue atlas Arabidopsis - ProteomicsDB",114,32188942,"MaxQuant score",146.8100000,1.0000000,,,,6.756020187737E-9,
YPLADSPHPLK,ph,S,238,true,"TOR Kinase and ABA Receptor",100,29290610,XCorr,3.8718803,1.0000000,,,,0.00018160000036005,
YPLADSPHPLK,ph,S,238,true,"Tissue atlas Arabidopsis - ProteomicsDB",114,32188942,"MaxQuant score",150.0600000,1.0000000,,,,0,
RISQMERNPSFTQPTGDVSGGR,ph,S,250,true,"TOR Kinase and ABA Receptor",100,29290610,XCorr,4.6069336,0.9996000,,,,0.0017490000464022,
RISQMER,ph,S,250,true,"Phospho cell culture sucrose/TOR",109,30833711,,,1.0000000,,,,,
RISQMER,ph,S,250,true,"Tissue atlas Arabidopsis - ProteomicsDB",114,32188942,"MaxQuant score",95.4830000,1.0000000,,,,0.0084328297525644,
RISQMERNPSFTQPTGDVSGGR,ph,S,257,true,"TOR Kinase and ABA Receptor",100,29290610,XCorr,4.6069336,0.8073000,,,,0.0017490000464022,
NPSFTQPTGDVSGGR,ph,S,257,true,"LAXIC - ABA stress",84a,23660473,XCorr,4.0700000,0.9990000,,,,6.4200001361314E-5,
NPSFTQPTGDVSGGR,ph,S,257,true,"atm and atr DNA damage response",88,25561503,"MASCOT Score",65.0000000,0.9390000,,,,,-0.8400000
NPSFTQPTGDVSGGR,ph,S,257,true,"TOR Kinase and ABA Receptor",100,29290610,XCorr,4.2403159,0.9987000,,,,3.9499998820247E-5,
NPSFTQPTGDVSGGR,ph,S,257,true,"Tissue atlas Arabidopsis - ProteomicsDB",114,32188942,"MaxQuant score",325.7900000,1.0000000,,,,0,
NPSFTQPTGDVSGGR,ph,S,266,true,"Tissue atlas Arabidopsis - ProteomicsDB",114,32188942,"MaxQuant score",260.2500000,0.9736720,,,,0,
NVVGQSPR,ph,S,280,true,"Large-scale phosphorylation discovery",44,23111157,XCorr,2.4210000,,,,,,
NVVGQSPR,ph,S,280,true,"atm and atr DNA damage response",88,25561503,"MASCOT Score",39.0000000,1.0000000,,,,,-0.0600000
NVVGQSPR,ph,S,280,true,"TOR Kinase and ABA Receptor",100,29290610,XCorr,2.0760944,1.0000000,,,,0.0015849999617785,
NVVGQSPR,ph,S,280,true,"Tissue atlas Arabidopsis - ProteomicsDB",114,32188942,"MaxQuant score",137.2800000,1.0000000,,,,0.0024910499341786,
RVSTGSASSLLGTTR,ph,S,291,true,"Large-scale phosphorylation discovery",44,23111157,XCorr,3.3930000,,,,,,
RVSTGSASSLLGTTR,ph,S,291,true,"atm and atr DNA damage response",88,25561503,"MASCOT Score",55.0000000,0.9890000,,,,,-0.4200000
RVSTGSASSLLGTTR,ph,S,291,true,"Brassinosteroid-Regulated Phosphorylation Dynamics",94,26187819,"MaxQuant Score",90.1930000,0.9550000,,,,0.019999999552965,0.9230000
RVSTGSASSLLGTTR,ph,S,291,true,"TOR Kinase and ABA Receptor",100,29290610,XCorr,4.3176479,0.9231000,,,,0.0029720000457019,
RVSTGSASSLLGTTR,ph,S,291,true,"Tissue atlas Arabidopsis - ProteomicsDB",114,32188942,"MaxQuant score",198.6400000,0.9991040,,,,4.3179301745641E-33,
RVSTGSASSLLGTTR,ph,T,292,true,"STN8 phosphoproteome",38,21768351,"MASCOT Score",44.3000000,,,,,,
RVSTGSASSLLGTTR,ph,T,292,true,"atm and atr DNA damage response",88,25561503,"MASCOT Score",44.0000000,0.9920000,,,,,0.4600000
RVSTGSASSLLGTTR,ph,T,292,true,"Col-0 callus - FC Col-0 vs. Col-0 Xray",111a,31410901,,37.6800000,,0.8253672,0.0000000,NO,,1.4158777
RVSTGSASSLLGTTR,ph,T,292,true,"Col-0 X-ray callus - FC Col-0 vs. Col-0 Xray",111b,31410901,,37.6800000,,0.8253672,0.0000000,NO,,1.4158777
RVSTGSASSLLGTTR,ph,T,292,true,"atm callus - FC atm vs. atm Xray",111c,31410901,,37.6800000,,0.9154029,0.0000000,NO,,1.4158777
RVSTGSASSLLGTTR,ph,T,292,true,"atm-3 X-ray callus - FC atm vs. atm Xray",111d,31410901,,37.6800000,,0.9154029,0.0000000,NO,,1.4158777
VSTGSASSLLGTTR,ph,T,292,true,"Tissue atlas Arabidopsis - ProteomicsDB",114,32188942,"MaxQuant score",141.6400000,0.9951710,,,,3.7957601506378E-8,
RVSTGSASSLLGTTR,ph,S,294,true,"atm and atr DNA damage response",88,25561503,"MASCOT Score",44.0000000,1.0000000,,,,,0.4600000
RVSTGSASSLLGTTR,ph,S,294,true,"Brassinosteroid-Regulated Phosphorylation Dynamics",94,26187819,"MaxQuant Score",90.1930000,0.9100000,,,,0.019999999552965,0.9230000
RVSTGSASSLLGTTR,ph,S,294,true,"Col-0 callus - FC Col-0 vs. Col-0 Xray",111a,31410901,,37.6800000,,0.8253672,0.0000000,NO,,1.4158777
RVSTGSASSLLGTTR,ph,S,294,true,"Col-0 X-ray callus - FC Col-0 vs. Col-0 Xray",111b,31410901,,37.6800000,,0.8253672,0.0000000,NO,,1.4158777
RVSTGSASSLLGTTR,ph,S,294,true,"atm callus - FC atm vs. atm Xray",111c,31410901,,37.6800000,,0.9154029,0.0000000,NO,,1.4158777
RVSTGSASSLLGTTR,ph,S,294,true,"atm-3 X-ray callus - FC atm vs. atm Xray",111d,31410901,,37.6800000,,0.9154029,0.0000000,NO,,1.4158777
RVSTGSASSLLGTTR,ph,S,294,true,"Tissue atlas Arabidopsis - ProteomicsDB",114,32188942,"MaxQuant score",198.6400000,0.9977470,,,,4.3179301745641E-33,
VSTGSASSLLGTTR,ph,S,294,true,"atm and atr DNA damage response",88,25561503,"MASCOT Score",64.0000000,0.9960000,,,,,0.7700000
RVSTGSASSLLGTTR,ph,S,296,true,"Col-0 callus - FC Col-0 vs. Col-0 Xray",111a,31410901,,37.6800000,,0.8253672,0.0000000,NO,,1.4158777
RVSTGSASSLLGTTR,ph,S,296,true,"Col-0 X-ray callus - FC Col-0 vs. Col-0 Xray",111b,31410901,,37.6800000,,0.8253672,0.0000000,NO,,1.4158777
RVSTGSASSLLGTTR,ph,S,296,true,"atm callus - FC atm vs. atm Xray",111c,31410901,,37.6800000,,0.9154029,0.0000000,NO,,1.4158777
RVSTGSASSLLGTTR,ph,S,296,true,"atm-3 X-ray callus - FC atm vs. atm Xray",111d,31410901,,37.6800000,,0.9154029,0.0000000,NO,,1.4158777
RVSTGSASSLLGTTR,ph,S,296,true,"Tissue atlas Arabidopsis - ProteomicsDB",114,32188942,"MaxQuant score",105.9900000,0.8239610,,,,0.00031934000435285,
RVSTGSASSLLGTTR,ph,S,297,true,"atm and atr DNA damage response",88,25561503,"MASCOT Score",44.0000000,0.9920000,,,,,0.4600000
RVSTGSASSLLGTTR,ph,S,297,true,"Brassinosteroid-Regulated Phosphorylation Dynamics",94,26187819,"MaxQuant Score",90.1930000,0.8570000,,,,0.019999999552965,0.9230000
RVSTGSASSLLGTTR,ph,S,297,true,"Tissue atlas Arabidopsis - ProteomicsDB",114,32188942,"MaxQuant score",198.6400000,0.9871520,,,,4.3179301745641E-33,
VSTGSASSLLGTTR,ph,S,297,true,"atm and atr DNA damage response",88,25561503,"MASCOT Score",64.0000000,0.9410000,,,,,0.7700000
RLDFSNDSPR,ph,S,313,true,"STN8 phosphoproteome",38,21768351,"MASCOT Score",42.8400000,,,,,,-0.7132740
RLDFSNDSPR,ph,S,313,true,"Chloroplast kinase substrates",60,19376835,"MASCOT Score",41.9900000,,,,,,-0.7132740
RLDFSNDSPR,ph,S,313,true,"atm and atr DNA damage response",88,25561503,"MASCOT Score",38.0000000,1.0000000,,,,,0.0600000
RLDFSNDSPR,ph,S,313,true,"TOR Kinase and ABA Receptor",100,29290610,XCorr,2.6773195,0.9839000,,,,0.014639999717474,
LDFSNDSPR,ph,S,313,true,"STN8 phosphoproteome",38,21768351,"MASCOT Score",68.6000000,,,,,,1.0346100
LDFSNDSPR,ph,S,313,true,"atm and atr DNA damage response",88,25561503,"MASCOT Score",37.0000000,1.0000000,,,,,1.3500000
LDFSNDSPR,ph,S,313,true,"Tissue atlas Arabidopsis - ProteomicsDB",114,32188942,"MaxQuant score",175.9700000,0.9999970,,,,7.6278702465515E-8,
LDFSNDSPRSNNGSFR,ph,S,316,true,"Tissue atlas Arabidopsis - ProteomicsDB",114,32188942,"MaxQuant score",128.1000000,0.9997000,,,,7.6278702465515E-8,
KMEDPPYAAGNSFAR,ph,S,334,true,"Tissue atlas Arabidopsis - ProteomicsDB",114,32188942,"MaxQuant score",83.2510000,0.9999880,,,,3.8370901165763E-5,
DKGDSSEIGDNDMNDR,ph,S,342,true,"Tissue atlas Arabidopsis - ProteomicsDB",114,32188942,"MaxQuant score",84.1590000,0.9223530,,,,6.7674802266993E-5,
DKGDSSEIGDNDMNDR,ph,S,343,true,"atm and atr DNA damage response",88,25561503,"MASCOT Score",47.0000000,0.9490000,,,,,0.5800000
DKGDSSEIGDNDMNDR,ph,S,343,true,"Tissue atlas Arabidopsis - ProteomicsDB",114,32188942,"MaxQuant score",220.7900000,0.9995500,,,,0,
GDSSEIGDNDMNDR,ph,S,343,true,"TOR Kinase and ABA Receptor",100,29290610,XCorr,2.2270570,0.8918000,,,,0.00029289998929016,
VYTIDSVHHSVSHSGTAEQK,ph,S,367,true,"Tissue atlas Arabidopsis - ProteomicsDB",114,32188942,"MaxQuant score",189.8400000,0.7928460,,,,0,
FKNDTADGYAMSPR,ph,S,385,true,"Chloroplast kinase substrates",60,19376835,"MASCOT Score",79.7200000,,,,,,-1.1830900
FKNDTADGYAMSPR,ph,S,385,true,"atm and atr DNA damage response",88,25561503,"MASCOT Score",42.0000000,1.0000000,,,,,1.0000000
NDTADGYAMSPR,ph,S,385,true,"Tyrosine phosphorylation in Arabidopsis",59,18463617,"MASCOT Score",91.0000000,,,,,,-1.3076596
NDTADGYAMSPR,ph,S,385,true,"atm and atr DNA damage response",88,25561503,"MASCOT Score",59.0000000,1.0000000,,,,,0.0900000
NDTADGYAMSPR,ph,S,385,true,"TOR Kinase and ABA Receptor",100,29290610,XCorr,4.6418729,1.0000000,,,,7.5919999176222E-8,
NDTADGYAMSPR,ph,S,385,true,"Phospho cell culture sucrose/TOR",109,30833711,,,0.9999490,,,,,
NDTADGYAMSPR,ph,S,385,true,"Tissue atlas Arabidopsis - ProteomicsDB",114,32188942,"MaxQuant score",270.1500000,1.0000000,,,,0,
