Peptide,PTM,ModifiedAA,ModifiedPosition,PeptideUniqueToGene,ExperimentDesc,ExpID,PubmedID,ScoreType,IdentScore,LocProb,Log2FChange,PQ-val,QuantSig,PEP,MassErrorPPM
MESTEQPRNISGSMQSPRSPSSHPY,nta,M,1,true,"Arabidopsis translation initiation landscape - NTA",167a,35069635,,,,,,,,
MESTEQPR,nta,M,1,true,"Arg/N-end rule pathway Roots",80,25728785,"MASCOT Score",44.5700000,,,,,0.00073520001024008,
MESTEQPR,nta,M,1,true,"Arg/N-end rule seed, prt6 vs. Wt",99,29168982,"MASCOT Score",69.4100000,,,,,0.047529999166727,0.5975804
NISGSMQSPR,nt,N,9,true,"Metacaspase9 substrates - Col-0 / mc9",51a,23964026,"MASCOT Score",76.0000000,,3.2420983,,NO,,-0.8579573
NISGSMQSPR,nt,N,9,true,"Metacaspase9 substrates - 35S:MC9 / mc9",51b,23964026,"MASCOT Score",73.0000000,,2.3464762,,NO,,-0.5147745
NISGSMQSPR,ph,S,11,true,"Tissue atlas Arabidopsis - ProteomicsDB",114,32188942,"MaxQuant score",136.9200000,0.9999590,,,,1.2835893933215E-42,
NISGSMQSPR,ph,S,13,true,"Tissue atlas Arabidopsis - ProteomicsDB",114,32188942,"MaxQuant score",94.7470000,0.9844780,,,,2.0788600068045E-6,
NISGSMQSPR,ph,S,16,true,"Large-scale phosphorylation discovery",44,23111157,XCorr,3.1890000,,,,,,
NISGSMQSPR,ph,S,16,true,"Tyrosine phosphorylation in Arabidopsis",59,18463617,"MASCOT Score",21.0000000,,,,,,-0.5192676
NISGSMQSPR,ph,S,16,true,"Chloroplast kinase substrates",60,19376835,"MASCOT Score",54.1100000,,,,,,0.0516561
NISGSMQSPR,ph,S,16,true,"srk2dei ABA signaling phopshoproteomics",83,23572148,"MASCOT Score",34.0000000,,,,,,0.0006000
NISGSMQSPR,ph,S,16,true,"atm and atr DNA damage response",88,25561503,"MASCOT Score",41.0000000,1.0000000,,,,,-0.8300000
NISGSMQSPR,ph,S,16,true,"Protein sumoylation and phosphorylation cross-talk",97,28419593,,,,,,,,
NISGSMQSPR,ph,S,16,true,"TOR Kinase and ABA Receptor",100,29290610,XCorr,2.9733477,0.9995000,,,,0.02449999935925,
NISGSMQSPR,ph,S,16,true,"Lateral root-induction - NAA vs control",106,23328941,"MASCOT Score",32.0000000,,0.5095265,0.0429672,YES,,
NISGSMQSPR,ph,S,16,true,"Phospho cell culture sucrose/TOR",109,30833711,,,0.9981600,,,,,
NISGSMQSPR,ph,S,16,true,"Tissue atlas Arabidopsis - ProteomicsDB",114,32188942,"MaxQuant score",195.1900000,1.0000000,,,,0,
SPSSHPYLSVSVTDPVK,ph,S,19,true,"SnRK2 protein kinase substrates",85,23776212,XCorr,2.3980498,0.7970000,,,,0.0004247679898981,
SPSSHPYLSVSVTDPVK,ph,S,19,true,"atm and atr DNA damage response",88,25561503,"MASCOT Score",46.0000000,0.9910000,,,,,-0.5000000
SPSSHPYLSVSVTDPVK,ph,S,19,true,"Lateral root-induction - NAA vs control",106,23328941,"MASCOT Score",27.0000000,,,,,,
SPSSHPYLSVSVTDPVK,ph,S,19,true,"Phospho cell culture sucrose/TOR",109,30833711,,,0.9810040,,,,,
SPSSHPYLSVSVTDPVK,ph,S,19,true,"Tissue atlas Arabidopsis - ProteomicsDB",114,32188942,"MaxQuant score",311.5400000,0.9956160,,,,0,
SPSSHPYLSVSVTDPVK,ph,S,21,true,"Col-0 callus - FC Col-0 vs. Col-0 Xray",111a,31410901,,59.9900000,,0.7322260,0.0000000,NO,,-0.3583846
SPSSHPYLSVSVTDPVK,ph,S,21,true,"Col-0 X-ray callus - FC Col-0 vs. Col-0 Xray",111b,31410901,,59.9900000,,0.7322260,0.0000000,NO,,-0.3583846
SPSSHPYLSVSVTDPVK,ph,S,21,true,"atm callus - FC atm vs. atm Xray",111c,31410901,,59.9900000,,0.9981447,0.0000000,NO,,-0.3583846
SPSSHPYLSVSVTDPVK,ph,S,21,true,"atm-3 X-ray callus - FC atm vs. atm Xray",111d,31410901,,59.9900000,,0.9981447,0.0000000,NO,,-0.3583846
SPSSHPYLSVSVTDPVK,ph,S,22,true,"Phosphoproteome iron-deficient Arabidopsis roots",41,22438062,"MASCOT Score",57.2200000,,,,,,
SPSSHPYLSVSVTDPVK,ph,Y,25,true,"srk2dei ABA signaling phopshoproteomics",83,23572148,"MASCOT Score",30.0000000,,,,,,0.0015000
SPSSHPYLSVSVTDPVK,ph,Y,25,true,"Lateral root-induction - NAA vs control",106,23328941,"MASCOT Score",21.0000000,,,,,,
SPSSHPYLSVSVTDPVK,ph,S,29,true,"Conserved plant phosphoproteome - Arabidopsis",61a,20466843,"MASCOT Score",24.0000000,1.0000000,,,,,
LLGACEGEPTGK,sno,C,237,true,"hot5-4 / wildtype, FAT-switch S-nitrosoproteome",169,37277371,,,,0.3281607,0.0061220,NO,,
LLGACEGEPTGK,so,C,237,true,"S-sulfenylation site detection using YAP1C",110,32714340,,,,,,,,
QHCELSETTK,sno,C,300,true,"hot5-4 / wildtype, FAT-switch S-nitrosoproteome",169,37277371,,,,,,,,
QHCELSETTK,so,C,300,true,"Arabidopsis S-sulfenylation chemoproteomics",108,31578252,"pFind PSM Score",0.2101350,,1.4492800,,,,-0.6714079
